develooper Front page | perl.perl5.porters | Postings from December 2017

Re: Smoke [blead] v5.26.0-1876-g815d526fdd FAIL(X) os/390 25.00(2964/)

Thread Previous
From:
Karl Williamson
Date:
December 28, 2017 06:04
Subject:
Re: Smoke [blead] v5.26.0-1876-g815d526fdd FAIL(X) os/390 25.00(2964/)
Message ID:
adfec652-0770-18d4-9a2c-83cad68f527c@khwilliamson.com
On 12/27/2017 03:46 AM, Yaroslav Kuzmin wrote:
> Smoke log available at https://drive.google.com/file/d/1j0hQlAXW4MH9CGPId3MRI0syVfNj8422
> 
> Automated smoke report for branch blead 5.27.8 patch 815d526fdd295b59d805cd4c2871b7a3604247b1 v5.26.0-1876-g815d526fdd
> RS12: 2964 (2964/)
>      on        os/390 - 25.00
>      using     c99 version
>      smoketime 5 hours 36 minutes (average 2 hours 48 minutes)
> 
> Summary: FAIL(X)

The apparent multi-concat bugs have gone away in this result.  THis 
happened without an obvious candidate for having fixed it, though there 
were fixes to multi-concat, and perhaps other things that we've fixed in 
the meantime could have incidentally caused it.  Or, we're just lucky 
this time.  We'll see if they resurface.

I have pushed fixes to blead for two problems shown in this report, and 
fixed it so that another failing test properly gives diagnostic output. 
The Pod-Html failures may all be due to a single flaw in a recent 
commit, which is now fixed in blead.
> 
> O = OK  F = Failure(s), extended report at the bottom
> X = Failure(s) under TEST but not under harness
> ? = still running or test results not (yet) available
> Build failures during:       - = unknown or N/A
> c = Configure, m = make, M = make (after miniperl), t = make test-prep
> 
> v5.26.0-1876-g815d526fdd  Configuration (common) none
> ----------- ---------------------------------------------------------
> X X X X     -Dusedl
>>
>>>
>>>>
>>>> +----- PERLIO = perlio -DDEBUGGING
>>> +------- PERLIO = stdio  -DDEBUGGING
>> +--------- PERLIO = perlio
> +----------- PERLIO = stdio
> 
> 
> Locally applied patches:
>      SMOKE815d526fdd295b59d805cd4c2871b7a3604247b1
> 
> Tests skipped on user request:
>      # One test name on a line
> Failures: (common-args) none
> [stdio] -Dusedl
> Inconsistent test results (between TEST and harness):
>      ../t/dist/Data-Dumper/t/dumper.t........ ..................................... FAILED at test 451
>      ../ext/Pod-Html/t/htmldir3.t............ ....................................... FAILED at test 1
>      ../ext/Pod-Html/t/htmldir2.t............ ....................................... FAILED at test 1
>      ../t/comp/parser_run.t.................. ............................................. FAILED at test 2
>      ../ext/Pod-Html/t/htmldir4.t............ ....................................... FAILED at test 1
>      ../ext/Pod-Html/t/htmldir1.t............ ....................................... FAILED at test 1
>      ../ext/Pod-Html/t/htmlview.t............ ....................................... FAILED at test 1
>      ../ext/Pod-Html/t/crossref.t............ ....................................... FAILED at test 1
>      ../t/porting/podcheck.t................. ............................................ FAILED--expected 1473 tests, saw 0
>      ../ext/Pod-Html/t/htmllink.t............ ....................................... FAILED at test 1
>      ../ext/Pod-Html/t/htmlescp.t............ ....................................... FAILED at test 1
>      ../ext/Pod-Html/t/feature.t............. ........................................ FAILED at test 1
>      ../lib/DBM_Filter/t/encode.t............ ....................................... FAILED at test 14
>      ../ext/Pod-Html/t/crossref3.t........... ...................................... FAILED at test 1
>      ../ext/Pod-Html/t/htmldir5.t............ ....................................... FAILED at test 1
>      ../t/dist/Devel-PPPort/t/pv_tools.t..... .................................. FAILED at test 7
>      ../t/op/exec.t.......................... ..................................................... FAILED at test 37
>      ../ext/Pod-Html/t/crossref2.t........... ...................................... FAILED at test 1
> 
> [perlio] -Dusedl
> Inconsistent test results (between TEST and harness):
>      ../t/porting/podcheck.t................. ............................................ FAILED--expected 1473 tests, saw 0
>      ../ext/Pod-Html/t/crossref.t............ ....................................... FAILED at test 1
>      ../ext/Pod-Html/t/htmldir1.t............ ....................................... FAILED at test 1
>      ../ext/Pod-Html/t/htmlview.t............ ....................................... FAILED at test 1
>      ../t/comp/parser_run.t.................. ............................................. FAILED at test 2
>      ../ext/Pod-Html/t/htmldir4.t............ ....................................... FAILED at test 1
>      ../ext/Pod-Html/t/htmldir2.t............ ....................................... FAILED at test 1
>      ../t/dist/Data-Dumper/t/dumper.t........ ..................................... FAILED at test 451
>      ../ext/Pod-Html/t/htmldir3.t............ ....................................... FAILED at test 1
>      ../ext/Pod-Html/t/crossref2.t........... ...................................... FAILED at test 1
>      ../t/op/exec.t.......................... ..................................................... FAILED at test 37
>      ../t/dist/Devel-PPPort/t/pv_tools.t..... .................................. FAILED at test 7
>      ../ext/Pod-Html/t/crossref3.t........... ...................................... FAILED at test 1
>      ../ext/Pod-Html/t/htmldir5.t............ ....................................... FAILED at test 1
>      ../ext/Pod-Html/t/feature.t............. ........................................ FAILED at test 1
>      ../lib/DBM_Filter/t/encode.t............ ....................................... FAILED at test 14
>      ../ext/Pod-Html/t/htmlescp.t............ ....................................... FAILED at test 1
>      ../ext/Pod-Html/t/htmllink.t............ ....................................... FAILED at test 1
> 
> [stdio] -DDEBUGGING -Dusedl
> Inconsistent test results (between TEST and harness):
>      ../t/dist/Data-Dumper/t/dumper.t........ ..................................... FAILED at test 451
>      ../ext/Pod-Html/t/htmldir3.t............ ....................................... FAILED at test 1
>      ../ext/Pod-Html/t/htmldir2.t............ ....................................... FAILED at test 1
>      ../ext/Pod-Html/t/crossref.t............ ....................................... FAILED at test 1
>      ../t/porting/podcheck.t................. ............................................ FAILED--expected 1473 tests, saw 0
>      ../t/comp/parser_run.t.................. ............................................. FAILED at test 2
>      ../ext/Pod-Html/t/htmldir4.t............ ....................................... FAILED at test 1
>      ../ext/Pod-Html/t/htmlview.t............ ....................................... FAILED at test 1
>      ../ext/Pod-Html/t/htmldir1.t............ ....................................... FAILED at test 1
>      ../ext/Pod-Html/t/htmlescp.t............ ....................................... FAILED at test 1
>      ../lib/DBM_Filter/t/encode.t............ ....................................... FAILED at test 14
>      ../ext/Pod-Html/t/feature.t............. ........................................ FAILED at test 1
>      ../ext/Pod-Html/t/htmllink.t............ ....................................... FAILED at test 1
>      ../t/op/exec.t.......................... ..................................................... FAILED at test 37
>      ../ext/Pod-Html/t/crossref2.t........... ...................................... FAILED at test 1
>      ../ext/Pod-Html/t/crossref3.t........... ...................................... FAILED at test 1
>      ../ext/Pod-Html/t/htmldir5.t............ ....................................... FAILED at test 1
>      ../t/dist/Devel-PPPort/t/pv_tools.t..... .................................. FAILED at test 7
> 
> [perlio] -DDEBUGGING -Dusedl
> Inconsistent test results (between TEST and harness):
>      ../lib/DBM_Filter/t/encode.t............ ....................................... FAILED at test 14
>      ../ext/Pod-Html/t/feature.t............. ........................................ FAILED at test 1
>      ../ext/Pod-Html/t/htmlescp.t............ ....................................... FAILED at test 1
>      ../ext/Pod-Html/t/htmllink.t............ ....................................... FAILED at test 1
>      ../t/op/exec.t.......................... ..................................................... FAILED at test 37
>      ../ext/Pod-Html/t/crossref2.t........... ...................................... FAILED at test 1
>      ../t/dist/Devel-PPPort/t/pv_tools.t..... .................................. FAILED at test 7
>      ../ext/Pod-Html/t/htmldir5.t............ ....................................... FAILED at test 1
>      ../ext/Pod-Html/t/crossref3.t........... ...................................... FAILED at test 1
>      ../ext/Pod-Html/t/htmldir2.t............ ....................................... FAILED at test 1
>      ../ext/Pod-Html/t/htmldir3.t............ ....................................... FAILED at test 1
>      ../t/dist/Data-Dumper/t/dumper.t........ ..................................... FAILED at test 451
>      ../t/porting/podcheck.t................. ............................................ FAILED--expected 1473 tests, saw 0
>      ../ext/Pod-Html/t/crossref.t............ ....................................... FAILED at test 1
>      ../ext/Pod-Html/t/htmlview.t............ ....................................... FAILED at test 1
>      ../ext/Pod-Html/t/htmldir1.t............ ....................................... FAILED at test 1
>      ../ext/Pod-Html/t/htmldir4.t............ ....................................... FAILED at test 1
>      ../t/comp/parser_run.t.................. ............................................. FAILED at test 2
> 
> Compiler messages(os390):
> 
> 
> 
> --
> Report by Test::Smoke v1.6 running on perl 5.24.1
> (Reporter v0.052 / Smoker v0.045)
> 
> 
> --
> 
> Regards,
> 
> Yaroslav Kuzmin
> Developer C/C++ ,z/OS , Linux
> 3 Zhukovskiy Street · Miass, Chelyabinsk region 456318 · Russia
> Tel:  +7.922.2.38.33.38
> Email: YKuzmin@rocketsoftware.com
> Web: www.rocketsoftware.com
> 
> ================================
> Rocket Software, Inc. and subsidiaries ■ 77 Fourth Avenue, Waltham MA 02451 ■ Main Office Toll Free Number: +1 877.328.2932
> Contact Customer Support: https://my.rocketsoftware.com/RocketCommunity/RCEmailSupport
> Unsubscribe from Marketing Messages/Manage Your Subscription Preferences - http://www.rocketsoftware.com/manage-your-email-preferences
> Privacy Policy - http://www.rocketsoftware.com/company/legal/privacy-policy
> ================================
> 
> This communication and any attachments may contain confidential information of Rocket Software, Inc. All unauthorized use, disclosure or distribution is prohibited. If you are not the intended recipient, please notify Rocket Software immediately and destroy all copies of this communication. Thank you.
> 

Thread Previous


nntp.perl.org: Perl Programming lists via nntp and http.
Comments to Ask Bjørn Hansen at ask@perl.org | Group listing | About