develooper Front page | perl.perl5.porters | Postings from October 2017

Smoke [5.27.5] v5.27.4-51-g1195d90a57 FAIL(Xc) netbsd 7.0.2_PATCH(evbarm/4 cpu)

From:
njh
Date:
October 6, 2017 10:54
Subject:
Smoke [5.27.5] v5.27.4-51-g1195d90a57 FAIL(Xc) netbsd 7.0.2_PATCH(evbarm/4 cpu)
Message ID:
20171006105436.76EC01626B3036@ps395777.dreamhostps.com
Automated smoke report for 5.27.5 patch 1195d90a5747942a65c309d1691cb3e85790e09e v5.27.4-51-g1195d90a57
pi2c.bandsman.co.uk: Cortex-A7 r0p5 (Cortex V7A core) (evbarm/4 cpu)
    on        netbsd - 7.0.2_PATCH
    using     cc version 4.8.4
    smoketime 5 hours 30 minutes (average 2 hours 45 minutes)

Summary: FAIL(Xc)

O = OK  F = Failure(s), extended report at the bottom
X = Failure(s) under TEST but not under harness
? = still running or test results not (yet) available
Build failures during:       - = unknown or N/A
c = Configure, m = make, M = make (after miniperl), t = make test-prep

v5.27.4-51-g1195d90a57  Configuration (common) -Accflags="-O2 -W -Wformat=2 -Wall -Wextra -pipe -mtune=cortex-a7 -fomit-frame-pointer -D_FORTIFY_SOURCE=2 -fstack-protector -Wstack-protector -Wfloat-equal"
----------- ---------------------------------------------------------
X -         -Duseithreads
c -         -Duselongdouble
| +--------- -DDEBUGGING
+----------- no debugging


Locally applied patches:
    SMOKE1195d90a5747942a65c309d1691cb3e85790e09e

Failures: (common-args) -Accflags="-O2 -W -Wformat=2 -Wall -Wextra -pipe -mtune=cortex-a7 -fomit-frame-pointer -D_FORTIFY_SOURCE=2 -fstack-protector -Wstack-protector -Wfloat-equal"
[default] -Duseithreads
Inconsistent test results (between TEST and harness):
    ../t/io/fs.t............................ ........................................................ FAILED at test 30
    ../t/op/time.t.......................... ...................................................... FAILED at test 7
    ../t/re/fold_grind.t.................... ................................................ FAILED--no leader found
    ../t/dist/Time-HiRes/t/utime.t.......... ........................................ FAILED at test 2

Compiler messages(gcc):
Configure ...try.c: In function 'main':
try.c: In function 'main':
try.c: In function 'blech':
try.c: In function 'blech_in_list':
try.c: In function 'bletch':
XSTest.c: In function 'XS_XSTest_T_BOOL_2':
XSTest.c:306:7: warning: unused variable 'RETVAL' [-Wunused-variable]
XSMore.c: In function 'XS_XSMore_nil':
/home/njh/perl5/perl-build-smoker/perl-current/XSUB.h:160:20: warning: unused variable 'items' [-Wunused-variable]
XSUsage.c: In function 'XS_XSUsage_two':
/home/njh/perl5/perl-build-smoker/perl-current/XSUB.h:191:20: warning: unused variable 'ix' [-Wunused-variable]
XSUsage.c: In function 'XS_XSUsage_four':

-- 
Report by Test::Smoke v1.53 build 1374 running on perl 5.22.0
(Reporter v0.050 / Smoker v0.045)



nntp.perl.org: Perl Programming lists via nntp and http.
Comments to Ask Bjørn Hansen at ask@perl.org | Group listing | About