develooper Front page | perl.perl5.porters | Postings from January 2017

Smoke [blead] v5.25.9-38-g4bf3140 FAIL(X) os/390 25.00 (2964/)

From:
Yaroslav Kuzmin
Date:
January 26, 2017 13:39
Subject:
Smoke [blead] v5.25.9-38-g4bf3140 FAIL(X) os/390 25.00 (2964/)
Message ID:
1485436970.27725.4.camel@rocketsoftware.com

Smoke logs available at https://drive.google.com/file/d/0B5PTttxwo7qAeUNmaGJ3R1lHNDA

Automated smoke report for branch blead 5.25.10 patch 4bf31405101ba885e9cddbf63b64e9b298992509 v5.25.9-38-g4bf3140
RS12: 2964 (2964/)
    on        os/390 - 25.00
    using     c99 version
    smoketime 7 hours 30 minutes (average 3 hours 45 minutes)

Summary: FAIL(X)

O = OK  F = Failure(s), extended report at the bottom
X = Failure(s) under TEST but not under harness
? = still running or test results not (yet) available
Build failures during:       - = unknown or N/A
c = Configure, m = make, M = make (after miniperl), t = make test-prep

v5.25.9-38-g4bf3140  Configuration (common) none
----------- ---------------------------------------------------------
X X X X     -Dusedl
>
> >
> > >
> > > +----- PERLIO = perlio -DDEBUGGING
> > +------- PERLIO = stdio  -DDEBUGGING
> +--------- PERLIO = perlio
+----------- PERLIO = stdio


Locally applied patches:
    SMOKE4bf31405101ba885e9cddbf63b64e9b298992509

Tests skipped on user request:
    # One test name on a line
Failures: (common-args) none
[stdio] -Dusedl
Inconsistent test results (between TEST and harness):
    ../lib/DBM_Filter/t/encode.t............ ....................................... FAILED at test 14
    ../t/porting/podcheck.t................. ............................................ FAILED--expected 1444 tests, saw 0
    ../t/dist/Net-Ping/t/010_pingecho.t..... .................................. FAILED at test 2

[perlio] -Dusedl
[stdio] -DDEBUGGING -Dusedl
Inconsistent test results (between TEST and harness):
    ../lib/DBM_Filter/t/encode.t............ ....................................... FAILED at test 14
    ../t/dist/Net-Ping/t/010_pingecho.t..... .................................. FAILED at test 2
    ../t/porting/podcheck.t................. ............................................ FAILED--expected 1444 tests, saw 0

[perlio] -DDEBUGGING -Dusedl
Inconsistent test results (between TEST and harness):
    ../t/re/fold_grind.t.................... ............................................... FAILED--no leader found
    ../lib/DBM_Filter/t/encode.t............ ....................................... FAILED at test 14
    ../t/dist/Net-Ping/t/010_pingecho.t..... .................................. FAILED at test 2
    ../t/porting/podcheck.t................. ............................................ FAILED--expected 1444 tests, saw 0

Compiler messages(os390):



--
Report by Test::Smoke v1.6 running on perl 5.22.0
(Reporter v0.052 / Smoker v0.045)



--

Regards,

Yaroslav Kuzmin
Developer C/C++ ,z/OS , Linux
3 Zhukovskiy Street · Miass, Chelyabinsk region 456318 · Russia
Tel:  +7.922.2.38.33.38
Email: YKuzmin@rocketsoftware.com
Web: www.rocketsoftware.com

================================
Rocket Software, Inc. and subsidiaries ■ 77 Fourth Avenue, Waltham MA 02451 ■ +1 877.328.2932 ■ +1 781.577.4321
Unsubscribe from Marketing Messages/Manage Your Subscription Preferences - http://www.rocketsoftware.com/manage-your-email-preferences
Privacy Policy - http://www.rocketsoftware.com/company/legal/privacy-policy
================================

This communication and any attachments may contain confidential information of Rocket Software, Inc. All unauthorized use, disclosure or distribution is prohibited. If you are not the intended recipient, please notify Rocket Software immediately and destroy all copies of this communication. Thank you.



nntp.perl.org: Perl Programming lists via nntp and http.
Comments to Ask Bjørn Hansen at ask@perl.org | Group listing | About