develooper Front page | perl.perl5.porters | Postings from October 2016

Smoke [blead] v5.25.6-76-gc1b1197 FAIL(X) os/390 25.00 (2964/)

Thread Next
From:
Yaroslav Kuzmin
Date:
October 27, 2016 10:21
Subject:
Smoke [blead] v5.25.6-76-gc1b1197 FAIL(X) os/390 25.00 (2964/)
Message ID:
1477563645.32434.6.camel@rocketsoftware.com

Smoke logs at available https://drive.google.com/file/d/0B5PTttxwo7qAZ2ctX2ZpUXgxdGM

Automated smoke report for branch blead 5.25.7 patch c1b11977bdf89506d2fd4a71f38929dd05db2580
v5.25.6-76-gc1b1197
RS12: 2964 (2964/)
    on        os/390 - 25.00
    using     c99 version
    smoketime 5 hours 27 minutes (average 2 hours 43 minutes)

Summary: FAIL(X)

O = OK  F = Failure(s), extended report at the bottom
X = Failure(s) under TEST but not under harness
? = still running or test results not (yet) available
Build failures during:       - = unknown or N/A
c = Configure, m = make, M = make (after miniperl), t = make test-prep

v5.25.6-76-gc1b1197  Configuration (common) none
----------- ---------------------------------------------------------
X X X X     -Dusedl
>
> >
> > >
> > > +----- PERLIO = perlio -DDEBUGGING
> > +------- PERLIO = stdio  -DDEBUGGING
> +--------- PERLIO = perlio
+----------- PERLIO = stdio


Locally applied patches:
    SMOKEc1b11977bdf89506d2fd4a71f38929dd05db2580

Tests skipped on user request:
    # One test name on a line
Failures: (common-args) none
[stdio] -Dusedl
Inconsistent test results (between TEST and harness):
    ../lib/warnings.t....................... ..................................................
FAILED at test 518
    ../ext/XS-APItest/t/utf8.t.............. ......................................... FAILED at
test 22446
    ../t/op/lex.t........................... ......................................................
FAILED at test 32

[perlio] -Dusedl
Inconsistent test results (between TEST and harness):
    ../t/op/lex.t........................... ......................................................
FAILED at test 32
    ../ext/XS-APItest/t/utf8.t.............. ......................................... FAILED at
test 22446
    ../t/dist/Net-Ping/t/010_pingecho.t..... .................................. FAILED at test 2
    ../lib/warnings.t....................... ..................................................
FAILED at test 518

[stdio/perlio] -DDEBUGGING -Dusedl
Inconsistent test results (between TEST and harness):
    ../ext/XS-APItest/t/utf8.t.............. ......................................... FAILED at
test 22446
    ../t/op/lex.t........................... ......................................................
FAILED at test 32
    ../lib/warnings.t....................... ..................................................
FAILED at test 518
    ../t/dist/Net-Ping/t/010_pingecho.t..... .................................. FAILED at test 2

Compiler messages(os390):



--
Report by Test::Smoke v1.6 running on perl 5.22.0
(Reporter v0.052 / Smoker v0.045)


--

Regards,

Yaroslav Kuzmin
Developer C/C++ ,z/OS , Linux
3 Zhukovskiy Street · Miass, Chelyabinsk region 456318 · Russia
Tel:  +7.922.2.38.33.38
Email: YKuzmin@rocketsoftware.com
Web: www.rocketsoftware.com


================================
Rocket Software, Inc. and subsidiaries ■ 77 Fourth Avenue, Waltham MA 02451 ■ +1 877.328.2932 ■ +1 781.577.4321
Unsubscribe from Marketing Messages/Manage Your Subscription Preferences - http://www.rocketsoftware.com/manage-your-email-preferences
Privacy Policy - http://www.rocketsoftware.com/company/legal/privacy-policy
================================

This communication and any attachments may contain confidential information of Rocket Software, Inc. All unauthorized use, disclosure or distribution is prohibited. If you are not the intended recipient, please notify Rocket Software immediately and destroy all copies of this communication. Thank you.

Thread Next


nntp.perl.org: Perl Programming lists via nntp and http.
Comments to Ask Bjørn Hansen at ask@perl.org | Group listing | About