develooper Front page | perl.perl5.porters | Postings from October 2016

Build failed in Jenkins: perl5-threaded #7691

From:
dennis+p5p-jenkins
Date:
October 19, 2016 13:01
Subject:
Build failed in Jenkins: perl5-threaded #7691
Message ID:
1796910532.609.1476882068535.JavaMail.jenkins@jenkins-001.ams6.corp.booking.com
See <http://perl5.git.perl.org:8080/job/perl5-threaded/7691/changes>

Changes:

[demerphq] pp_(hot|ctl).c: switch croak() to Perl_croak() for win32

------------------------------------------
[...truncated 4511 lines...]
mv Typemap.xsc Typemap.c
Extracting xsubpp (with variable substitutions)
found.
Trying struct stat st_uatime...<http://perl5.git.perl.org:8080/job/perl5-threaded/ws/ext/XS-Typemap/../../miniperl> "-I../../lib" -MExtUtils::Command::MM -e 'cp_nonempty' -- Typemap.bs ../../lib/auto/XS/Typemap/Typemap.bs 644
../miniperl -I../lib pod2html.PL
ccache gcc -c   -D_REENTRANT -D_GNU_SOURCE -fwrapv -fno-strict-aliasing -pipe -fstack-protector -I/usr/local/include -D_LARGEFILE_SOURCE -D_FILE_OFFSET_BITS=64 -D_FORTIFY_SOURCE=2 -Wall -Werror=declaration-after-statement -Wextra -Wc++-compat -Wwrite-strings -O2   -DVERSION=\"0.14\" -DXS_VERSION=\"0.14\" -fPIC "-I../.."   Typemap.c
Extracting pod2html (with variable substitutions)
../miniperl -I../lib zipdetails.PL
Extracting zipdetails (with variable substitutions)
make[1]: Leaving directory `<http://perl5.git.perl.org:8080/job/perl5-threaded/ws/utils'>
"../../../miniperl" "-I../../../lib" ../bin/enc2xs -"Q" -o eu_01_t.c -f eu_01_t.fnm
ccache gcc -c   -D_REENTRANT -D_GNU_SOURCE -fwrapv -fno-strict-aliasing -pipe -fstack-protector -I/usr/local/include -D_LARGEFILE_SOURCE -D_FILE_OFFSET_BITS=64 -D_FORTIFY_SOURCE=2 -Wno-deprecated-declarations -Wall -Werror=declaration-after-statement -Wextra -Wc++-compat -Wwrite-strings -O2   -DVERSION=\"0.86\" -DXS_VERSION=\"0.86\" -fPIC "-I../.."   exception.c
NOT found.
You seem to have stat() subsecond timestamps.
(Your struct stat has them, but the filesystems must help.)
Generating a Unix-style Makefile
Writing Makefile for Time::HiRes
make[1]: Entering directory `<http://perl5.git.perl.org:8080/job/perl5-threaded/ws/dist/Time-HiRes'>
Running Mkbootstrap for Collate ()
ccache gcc -c   -D_REENTRANT -D_GNU_SOURCE -fwrapv -fno-strict-aliasing -pipe -fstack-protector -I/usr/local/include -D_LARGEFILE_SOURCE -D_FILE_OFFSET_BITS=64 -D_FORTIFY_SOURCE=2 -Wno-deprecated-declarations -Wall -Werror=declaration-after-statement -Wextra -Wc++-compat -Wwrite-strings -O2   -DVERSION=\"0.86\" -DXS_VERSION=\"0.86\" -fPIC "-I../.."   notcore.c
chmod 644 "Collate.bs"
"../../miniperl" "-I../../lib" "../../lib/ExtUtils/xsubpp"  -typemap '<http://perl5.git.perl.org:8080/job/perl5-threaded/ws/cpan/Unicode-Collate/../../lib/ExtUtils/typemap'>  Collate.xs > Collate.xsc
mv Collate.xsc Collate.c
<http://perl5.git.perl.org:8080/job/perl5-threaded/ws/cpan/Unicode-Collate/../../miniperl> "-I../../lib" -MExtUtils::Command::MM -e 'cp_nonempty' -- Collate.bs ../../lib/auto/Unicode/Collate/Collate.bs 644
Running Mkbootstrap for HiRes ()
ccache gcc -c   -D_REENTRANT -D_GNU_SOURCE -fwrapv -fno-strict-aliasing -pipe -fstack-protector -I/usr/local/include -D_LARGEFILE_SOURCE -D_FILE_OFFSET_BITS=64 -D_FORTIFY_SOURCE=2 -Wall -Werror=declaration-after-statement -Wextra -Wc++-compat -Wwrite-strings -O2   -DVERSION=\"1.14\" -DXS_VERSION=\"1.14\" -fPIC "-I../.."   Collate.c
chmod 644 "HiRes.bs"
"../../miniperl" "-I../../lib" "../../lib/ExtUtils/xsubpp"  -typemap '<http://perl5.git.perl.org:8080/job/perl5-threaded/ws/dist/Time-HiRes/../../lib/ExtUtils/typemap'> -typemap '<http://perl5.git.perl.org:8080/job/perl5-threaded/ws/dist/Time-HiRes/typemap'>  HiRes.xs > HiRes.xsc
<http://perl5.git.perl.org:8080/job/perl5-threaded/ws/ext/XS-APItest/../../miniperl> "-I../../lib" -MExtUtils::Command::MM -e 'cp_nonempty' -- APItest.bs ../../lib/auto/XS/APItest/APItest.bs 644
ccache gcc -c   -D_REENTRANT -D_GNU_SOURCE -fwrapv -fno-strict-aliasing -pipe -fstack-protector -I/usr/local/include -D_LARGEFILE_SOURCE -D_FILE_OFFSET_BITS=64 -D_FORTIFY_SOURCE=2 -Wno-deprecated-declarations -Wall -Werror=declaration-after-statement -Wextra -Wc++-compat -Wwrite-strings -O2   -DVERSION=\"0.86\" -DXS_VERSION=\"0.86\" -fPIC "-I../.."   APItest.c
Reading euc-kr (euc-kr)
ccache gcc -c   -D_REENTRANT -D_GNU_SOURCE -fwrapv -fno-strict-aliasing -pipe -fstack-protector -I/usr/local/include -D_LARGEFILE_SOURCE -D_FILE_OFFSET_BITS=64 -D_FORTIFY_SOURCE=2 -Wno-deprecated-declarations -Wall -Werror=declaration-after-statement -Wextra -Wc++-compat -Wwrite-strings -O2   -DVERSION=\"0.86\" -DXS_VERSION=\"0.86\" -fPIC "-I../.."   XSUB-undef-XS_VERSION.c
mv HiRes.xsc HiRes.c
<http://perl5.git.perl.org:8080/job/perl5-threaded/ws/dist/Time-HiRes/../../miniperl> "-I../../lib" -MExtUtils::Command::MM -e 'cp_nonempty' -- HiRes.bs ../../lib/auto/Time/HiRes/HiRes.bs 644
ccache gcc -c   -D_REENTRANT -D_GNU_SOURCE -fwrapv -fno-strict-aliasing -pipe -fstack-protector -I/usr/local/include -D_LARGEFILE_SOURCE -D_FILE_OFFSET_BITS=64 -D_FORTIFY_SOURCE=2 -Wall -Werror=declaration-after-statement -Wextra -Wc++-compat -Wwrite-strings -O2   -DVERSION=\"1.9740_01\" -DXS_VERSION=\"1.9740_01\" -fPIC "-I../.."  -DTIME_HIRES_NANOSLEEP -DTIME_HIRES_CLOCKID_T -DTIME_HIRES_CLOCK_GETTIME -DTIME_HIRES_CLOCK_GETRES -DTIME_HIRES_CLOCK_NANOSLEEP -DTIME_HIRES_CLOCK -DHAS_FUTIMENS -DHAS_UTIMENSAT -DTIME_HIRES_UTIME -DTIME_HIRES_STAT_XTIM -DTIME_HIRES_STAT=4 -DATLEASTFIVEOHOHFIVE HiRes.c
Reading cp949 (cp949)
"../../../miniperl" "-I../../../lib" ../bin/enc2xs -"Q" -o jo_02_t.c -f jo_02_t.fnm
"../../../miniperl" "-I../../../lib" ../bin/enc2xs -"Q" -o ks_03_t.c -f ks_03_t.fnm
Typemap.xs: In function ‘XS_XS__Typemap_T_PACKEDARRAY_out’:
Typemap.xs:848: warning: comparison is always false due to limited range of data type
rm -f ../../lib/auto/XS/Typemap/Typemap.so
gcc  -shared -O2 -L/usr/local/lib -fstack-protector stdio.o  Typemap.o  -o ../../lib/auto/XS/Typemap/Typemap.so  \
	      \
	  
chmod 755 ../../lib/auto/XS/Typemap/Typemap.so
make[1]: Leaving directory `<http://perl5.git.perl.org:8080/job/perl5-threaded/ws/ext/XS-Typemap'>
"../../../miniperl" "-I../../../lib" ../bin/enc2xs -"Q" -o ma_04_t.c -f ma_04_t.fnm
HiRes.c: In function ‘XS_Time__HiRes_constant’:
./const-xs.inc:11: warning: ‘iv’ may be used uninitialized in this function
./const-xs.inc:11: note: ‘iv’ was declared here
rm -f ../../lib/auto/Time/HiRes/HiRes.so
LD_RUN_PATH="/lib/../lib64" gcc  -shared -O2 -L/usr/local/lib -fstack-protector HiRes.o  -o ../../lib/auto/Time/HiRes/HiRes.so  \
	   -lrt   \
	  
chmod 755 ../../lib/auto/Time/HiRes/HiRes.so
make[1]: Leaving directory `<http://perl5.git.perl.org:8080/job/perl5-threaded/ws/dist/Time-HiRes'>
ccache gcc -c -I./Encode  -I../Encode -D_REENTRANT -D_GNU_SOURCE -fwrapv -fno-strict-aliasing -pipe -fstack-protector -I/usr/local/include -D_LARGEFILE_SOURCE -D_FILE_OFFSET_BITS=64 -D_FORTIFY_SOURCE=2 -Wall -Werror=declaration-after-statement -Wextra -Wc++-compat -Wwrite-strings -O2   -DVERSION=\"2.03\" -DXS_VERSION=\"2.03\" -fPIC "-I../../.."   cp_00_t.c
./miniperl -Ilib make_ext.pl lib/auto/Math/BigInt/FastCalc/FastCalc.so  MAKE="make" LIBPERL_A=libperl.a LINKTYPE=dynamic
rm -f ../../lib/auto/Unicode/Collate/Collate.so
gcc  -shared -O2 -L/usr/local/lib -fstack-protector Collate.o  -o ../../lib/auto/Unicode/Collate/Collate.so  \
	      \
	  
chmod 755 ../../lib/auto/Unicode/Collate/Collate.so
make[1]: Leaving directory `<http://perl5.git.perl.org:8080/job/perl5-threaded/ws/cpan/Unicode-Collate'>
ccache gcc -c   -D_REENTRANT -D_GNU_SOURCE -fwrapv -fno-strict-aliasing -pipe -fstack-protector -I/usr/local/include -D_LARGEFILE_SOURCE -D_FILE_OFFSET_BITS=64 -D_FORTIFY_SOURCE=2 -Wno-deprecated-declarations -Wall -Werror=declaration-after-statement -Wextra -Wc++-compat -Wwrite-strings -O2   -DVERSION=\"0.86\" -DXS_VERSION=\"0.86\" -fPIC "-I../.."   XSUB-redefined-macros.c
Reading ksc5601-raw (ksc5601-raw)
ccache gcc -c -I./Encode  -I../Encode -D_REENTRANT -D_GNU_SOURCE -fwrapv -fno-strict-aliasing -pipe -fstack-protector -I/usr/local/include -D_LARGEFILE_SOURCE -D_FILE_OFFSET_BITS=64 -D_FORTIFY_SOURCE=2 -Wall -Werror=declaration-after-statement -Wextra -Wc++-compat -Wwrite-strings -O2   -DVERSION=\"2.03\" -DXS_VERSION=\"2.03\" -fPIC "-I../../.."   eu_01_t.c
ccache gcc -c -I./Encode  -I../Encode -D_REENTRANT -D_GNU_SOURCE -fwrapv -fno-strict-aliasing -pipe -fstack-protector -I/usr/local/include -D_LARGEFILE_SOURCE -D_FILE_OFFSET_BITS=64 -D_FORTIFY_SOURCE=2 -Wall -Werror=declaration-after-statement -Wextra -Wc++-compat -Wwrite-strings -O2   -DVERSION=\"2.03\" -DXS_VERSION=\"2.03\" -fPIC "-I../../.."   ks_03_t.c
<http://perl5.git.perl.org:8080/job/perl5-threaded/ws/cpan/Encode/KR/../../../miniperl> "-I../../../lib" -MExtUtils::Command::MM -e 'cp_nonempty' -- KR.bs ../../../lib/auto/Encode/KR/KR.bs 644
Processing ArabicShaping.txt
Generating a Unix-style Makefile
Writing Makefile for Math::BigInt::FastCalc
make[1]: Entering directory `<http://perl5.git.perl.org:8080/job/perl5-threaded/ws/cpan/Math-BigInt-FastCalc'>
Reading MacKorean (MacKorean)
ccache gcc -c -I./Encode  -I../Encode -D_REENTRANT -D_GNU_SOURCE -fwrapv -fno-strict-aliasing -pipe -fstack-protector -I/usr/local/include -D_LARGEFILE_SOURCE -D_FILE_OFFSET_BITS=64 -D_FORTIFY_SOURCE=2 -Wall -Werror=declaration-after-statement -Wextra -Wc++-compat -Wwrite-strings -O2   -DVERSION=\"2.03\" -DXS_VERSION=\"2.03\" -fPIC "-I../../.."   ma_04_t.c
Running Mkbootstrap for FastCalc ()
"../../miniperl" "-I../../lib" "../../lib/ExtUtils/xsubpp"  -typemap '<http://perl5.git.perl.org:8080/job/perl5-threaded/ws/cpan/Math-BigInt-FastCalc/../../lib/ExtUtils/typemap'>  FastCalc.xs > FastCalc.xsc
chmod 644 "FastCalc.bs"
<http://perl5.git.perl.org:8080/job/perl5-threaded/ws/cpan/Math-BigInt-FastCalc/../../miniperl> "-I../../lib" -MExtUtils::Command::MM -e 'cp_nonempty' -- FastCalc.bs ../../lib/auto/Math/BigInt/FastCalc/FastCalc.bs 644
Processing Blocks.txt
Processing PropList.txt
mv FastCalc.xsc FastCalc.c
ccache gcc -c   -D_REENTRANT -D_GNU_SOURCE -fwrapv -fno-strict-aliasing -pipe -fstack-protector -I/usr/local/include -D_LARGEFILE_SOURCE -D_FILE_OFFSET_BITS=64 -D_FORTIFY_SOURCE=2 -Wall -Werror=declaration-after-statement -Wextra -Wc++-compat -Wwrite-strings -O2   -DVERSION=\"0.42\" -DXS_VERSION=\"0.42\" -fPIC "-I../.."   FastCalc.c
Reading johab (johab)
"../../../miniperl" "-I../../../lib" "../../../lib/ExtUtils/xsubpp"  -nolinenumbers -typemap '<http://perl5.git.perl.org:8080/job/perl5-threaded/ws/cpan/Encode/KR/../../../lib/ExtUtils/typemap'>  KR.xs > KR.xsc
ccache gcc -c -I./Encode  -I../Encode -D_REENTRANT -D_GNU_SOURCE -fwrapv -fno-strict-aliasing -pipe -fstack-protector -I/usr/local/include -D_LARGEFILE_SOURCE -D_FILE_OFFSET_BITS=64 -D_FORTIFY_SOURCE=2 -Wall -Werror=declaration-after-statement -Wextra -Wc++-compat -Wwrite-strings -O2   -DVERSION=\"2.03\" -DXS_VERSION=\"2.03\" -fPIC "-I../../.."   jo_02_t.c
mv KR.xsc KR.c
Processing SpecialCasing.txt
ccache gcc -c -I./Encode  -I../Encode -D_REENTRANT -D_GNU_SOURCE -fwrapv -fno-strict-aliasing -pipe -fstack-protector -I/usr/local/include -D_LARGEFILE_SOURCE -D_FILE_OFFSET_BITS=64 -D_FORTIFY_SOURCE=2 -Wall -Werror=declaration-after-statement -Wextra -Wc++-compat -Wwrite-strings -O2   -DVERSION=\"2.03\" -DXS_VERSION=\"2.03\" -fPIC "-I../../.."   KR.c
re_exec.c: In function ‘my_regexec’:
re_exec.c:3133: warning: comparison is always false due to limited range of data type
re_exec.c:3144: warning: comparison is always false due to limited range of data type
re_exec.c: In function ‘S_setup_EXACTISH_ST_c1_c2’:
re_exec.c:4087: warning: comparison is always false due to limited range of data type
re_exec.c:4088: warning: comparison is always false due to limited range of data type
re_exec.c: In function ‘S_regmatch’:
re_exec.c:5668: warning: passing argument 1 of ‘PerlIO_printf’ from incompatible pointer type
../../perlio.h:241: note: expected ‘struct PerlIOl **’ but argument is of type ‘struct PerlInterpreter *’
re_exec.c:5668: warning: passing argument 2 of ‘PerlIO_printf’ from incompatible pointer type
../../perlio.h:241: note: expected ‘const char *’ but argument is of type ‘struct PerlIOl **’
make[1]: Leaving directory `<http://perl5.git.perl.org:8080/job/perl5-threaded/ws/ext/re'>
make[1]: Entering directory `<http://perl5.git.perl.org:8080/job/perl5-threaded/ws/ext/re'>
ccache gcc -c   -D_REENTRANT -D_GNU_SOURCE -fwrapv -fno-strict-aliasing -pipe -fstack-protector -I/usr/local/include -D_LARGEFILE_SOURCE -D_FILE_OFFSET_BITS=64 -D_FORTIFY_SOURCE=2 -Wall -Werror=declaration-after-statement -Wextra -Wc++-compat -Wwrite-strings -O2   -DVERSION=\"0.33\" -DXS_VERSION=\"0.33\" -fPIC "-I../.."  -DPERL_EXT_RE_BUILD -DPERL_EXT_RE_DEBUG -DPERL_EXT re_comp.c
<http://perl5.git.perl.org:8080/job/perl5-threaded/ws/ext/re/../../miniperl> "-I../../lib" -MExtUtils::Command::MM -e 'cp_nonempty' -- re.bs ../../lib/auto/re/re.bs 644
ccache gcc -c   -D_REENTRANT -D_GNU_SOURCE -fwrapv -fno-strict-aliasing -pipe -fstack-protector -I/usr/local/include -D_LARGEFILE_SOURCE -D_FILE_OFFSET_BITS=64 -D_FORTIFY_SOURCE=2 -Wall -Werror=declaration-after-statement -Wextra -Wc++-compat -Wwrite-strings -O2   -DVERSION=\"0.33\" -DXS_VERSION=\"0.33\" -fPIC "-I../.."  -DPERL_EXT_RE_BUILD -DPERL_EXT_RE_DEBUG -DPERL_EXT re.c
rm -f ../../../lib/auto/Encode/KR/KR.so
gcc  -shared -O2 -L/usr/local/lib -fstack-protector KR.o cp_00_t.o eu_01_t.o jo_02_t.o ks_03_t.o ma_04_t.o  -o ../../../lib/auto/Encode/KR/KR.so  \
	      \
	  
rm -f ../../lib/auto/Math/BigInt/FastCalc/FastCalc.so
gcc  -shared -O2 -L/usr/local/lib -fstack-protector FastCalc.o  -o ../../lib/auto/Math/BigInt/FastCalc/FastCalc.so  \
	      \
	  
chmod 755 ../../lib/auto/Math/BigInt/FastCalc/FastCalc.so
Processing LineBreak.txt
chmod 755 ../../../lib/auto/Encode/KR/KR.so
make[1]: Leaving directory `<http://perl5.git.perl.org:8080/job/perl5-threaded/ws/cpan/Math-BigInt-FastCalc'>
make[2]: Leaving directory `<http://perl5.git.perl.org:8080/job/perl5-threaded/ws/cpan/Encode/KR'>
make[2]: Entering directory `<http://perl5.git.perl.org:8080/job/perl5-threaded/ws/cpan/Encode/Symbol'>
"../../../miniperl" "-I../../../lib" ../bin/enc2xs -"Q" -"O" -o symbol_t.c -f symbol_t.fnm
Running Mkbootstrap for Symbol ()
chmod 644 "Symbol.bs"
<http://perl5.git.perl.org:8080/job/perl5-threaded/ws/cpan/Encode/Symbol/../../../miniperl> "-I../../../lib" -MExtUtils::Command::MM -e 'cp_nonempty' -- Symbol.bs ../../../lib/auto/Encode/Symbol/Symbol.bs 644
Reading AdobeSymbol (AdobeSymbol)
Reading AdobeZdingbat (AdobeZdingbat)
Reading dingbats (dingbats)
Reading MacDingbats (MacDingbats)
Reading MacSymbol (MacSymbol)
Reading symbol (symbol)
"../../../miniperl" "-I../../../lib" "../../../lib/ExtUtils/xsubpp"  -nolinenumbers -typemap '<http://perl5.git.perl.org:8080/job/perl5-threaded/ws/cpan/Encode/Symbol/../../../lib/ExtUtils/typemap'>  Symbol.xs > Symbol.xsc
ccache gcc -c -I./Encode  -I../Encode -D_REENTRANT -D_GNU_SOURCE -fwrapv -fno-strict-aliasing -pipe -fstack-protector -I/usr/local/include -D_LARGEFILE_SOURCE -D_FILE_OFFSET_BITS=64 -D_FORTIFY_SOURCE=2 -Wall -Werror=declaration-after-statement -Wextra -Wc++-compat -Wwrite-strings -O2   -DVERSION=\"2.02\" -DXS_VERSION=\"2.02\" -fPIC "-I../../.."   symbol_t.c
mv Symbol.xsc Symbol.c
ccache gcc -c -I./Encode  -I../Encode -D_REENTRANT -D_GNU_SOURCE -fwrapv -fno-strict-aliasing -pipe -fstack-protector -I/usr/local/include -D_LARGEFILE_SOURCE -D_FILE_OFFSET_BITS=64 -D_FORTIFY_SOURCE=2 -Wall -Werror=declaration-after-statement -Wextra -Wc++-compat -Wwrite-strings -O2   -DVERSION=\"2.02\" -DXS_VERSION=\"2.02\" -fPIC "-I../../.."   Symbol.c
rm -f ../../../lib/auto/Encode/Symbol/Symbol.so
gcc  -shared -O2 -L/usr/local/lib -fstack-protector Symbol.o symbol_t.o  -o ../../../lib/auto/Encode/Symbol/Symbol.so  \
	      \
	  
re_comp.c: In function ‘S_make_trie’:
re_comp.c:2828: warning: comparison is always false due to limited range of data type
re_comp.c: In function ‘S_construct_ahocorasick_from_trie’:
re_comp.c:3530: warning: comparison is always false due to limited range of data type
re_comp.c:3531: warning: comparison is always false due to limited range of data type
re_comp.c: In function ‘S_join_exact’:
re_comp.c:3799: warning: comparison is always false due to limited range of data type
re_comp.c: In function ‘S_study_chunk’:
re_comp.c:4746: warning: comparison is always false due to limited range of data type
re_comp.c:4748: warning: comparison is always false due to limited range of data type
re_comp.c: In function ‘S_add_data’:
re_comp.c:5969: warning: comparison is always false due to limited range of data type
re_comp.c:5971: warning: comparison is always false due to limited range of data type
re_comp.c:5973: warning: comparison is always false due to limited range of data type
re_comp.c: In function ‘my_re_op_compile’:
re_comp.c:7247: warning: comparison is always false due to limited range of data type
re_comp.c:7275: warning: comparison is always false due to limited range of data type
re_comp.c:7661: warning: comparison is always false due to limited range of data type
re_comp.c: In function ‘my_regprop’:
re_comp.c:18932: warning: passing argument 2 of ‘Perl_sv_catpvn_flags’ from incompatible pointer type
../../proto.h:2984: note: expected ‘struct SV * const’ but argument is of type ‘struct PerlInterpreter *’
re_comp.c:18932: warning: passing argument 3 of ‘Perl_sv_catpvn_flags’ from incompatible pointer type
../../proto.h:2984: note: expected ‘const char *’ but argument is of type ‘struct SV *’
re_comp.c:18932: warning: passing argument 4 of ‘Perl_sv_catpvn_flags’ makes integer from pointer without a cast
../../proto.h:2984: note: expected ‘STRLEN’ but argument is of type ‘const char *’
re_comp.c:18932: error: too many arguments to function ‘Perl_sv_catpvn_flags’
make[1]: *** [re_comp.o] Error 1
make[1]: Leaving directory `<http://perl5.git.perl.org:8080/job/perl5-threaded/ws/ext/re'>
Unsuccessful make(ext/re): code=512 at make_ext.pl line 569.
make: *** [lib/auto/re/re.so] Error 25
make: *** Waiting for unfinished jobs....
chmod 755 ../../../lib/auto/Encode/Symbol/Symbol.so
Processing EastAsianWidth.txt
make[2]: Leaving directory `<http://perl5.git.perl.org:8080/job/perl5-threaded/ws/cpan/Encode/Symbol'>
make[2]: Entering directory `<http://perl5.git.perl.org:8080/job/perl5-threaded/ws/cpan/Encode/TW'>
"../../../miniperl" "-I../../../lib" ../bin/enc2xs -"Q" -o bi_00_t.c -f bi_00_t.fnm
Running Mkbootstrap for TW ()
"../../../miniperl" "-I../../../lib" ../bin/enc2xs -"Q" -o bi_01_t.c -f bi_01_t.fnm
"../../../miniperl" "-I../../../lib" ../bin/enc2xs -"Q" -o cp_02_t.c -f cp_02_t.fnm
chmod 644 "TW.bs"
"../../../miniperl" "-I../../../lib" ../bin/enc2xs -"Q" -o ma_03_t.c -f ma_03_t.fnm
<http://perl5.git.perl.org:8080/job/perl5-threaded/ws/cpan/Encode/TW/../../../miniperl> "-I../../../lib" -MExtUtils::Command::MM -e 'cp_nonempty' -- TW.bs ../../../lib/auto/Encode/TW/TW.bs 644
Processing CompositionExclusions.txt
Processing BidiMirroring.txt
Processing CaseFolding.txt
Processing DCoreProperties.txt
Reading big5-eten (big5-eten)
ccache gcc -c -I./Encode  -I../Encode -D_REENTRANT -D_GNU_SOURCE -fwrapv -fno-strict-aliasing -pipe -fstack-protector -I/usr/local/include -D_LARGEFILE_SOURCE -D_FILE_OFFSET_BITS=64 -D_FORTIFY_SOURCE=2 -Wall -Werror=declaration-after-statement -Wextra -Wc++-compat -Wwrite-strings -O2   -DVERSION=\"2.03\" -DXS_VERSION=\"2.03\" -fPIC "-I../../.."   bi_00_t.c
Reading MacChineseTrad (MacChineseTrad)
ccache gcc -c -I./Encode  -I../Encode -D_REENTRANT -D_GNU_SOURCE -fwrapv -fno-strict-aliasing -pipe -fstack-protector -I/usr/local/include -D_LARGEFILE_SOURCE -D_FILE_OFFSET_BITS=64 -D_FORTIFY_SOURCE=2 -Wall -Werror=declaration-after-statement -Wextra -Wc++-compat -Wwrite-strings -O2   -DVERSION=\"2.03\" -DXS_VERSION=\"2.03\" -fPIC "-I../../.."   ma_03_t.c
Reading cp950 (cp950)
ccache gcc -c -I./Encode  -I../Encode -D_REENTRANT -D_GNU_SOURCE -fwrapv -fno-strict-aliasing -pipe -fstack-protector -I/usr/local/include -D_LARGEFILE_SOURCE -D_FILE_OFFSET_BITS=64 -D_FORTIFY_SOURCE=2 -Wall -Werror=declaration-after-statement -Wextra -Wc++-compat -Wwrite-strings -O2   -DVERSION=\"2.03\" -DXS_VERSION=\"2.03\" -fPIC "-I../../.."   cp_02_t.c
Reading big5-hkscs (big5-hkscs)
"../../../miniperl" "-I../../../lib" "../../../lib/ExtUtils/xsubpp"  -nolinenumbers -typemap '<http://perl5.git.perl.org:8080/job/perl5-threaded/ws/cpan/Encode/TW/../../../lib/ExtUtils/typemap'>  TW.xs > TW.xsc
ccache gcc -c -I./Encode  -I../Encode -D_REENTRANT -D_GNU_SOURCE -fwrapv -fno-strict-aliasing -pipe -fstack-protector -I/usr/local/include -D_LARGEFILE_SOURCE -D_FILE_OFFSET_BITS=64 -D_FORTIFY_SOURCE=2 -Wall -Werror=declaration-after-statement -Wextra -Wc++-compat -Wwrite-strings -O2   -DVERSION=\"2.03\" -DXS_VERSION=\"2.03\" -fPIC "-I../../.."   bi_01_t.c
mv TW.xsc TW.c
ccache gcc -c -I./Encode  -I../Encode -D_REENTRANT -D_GNU_SOURCE -fwrapv -fno-strict-aliasing -pipe -fstack-protector -I/usr/local/include -D_LARGEFILE_SOURCE -D_FILE_OFFSET_BITS=64 -D_FORTIFY_SOURCE=2 -Wall -Werror=declaration-after-statement -Wextra -Wc++-compat -Wwrite-strings -O2   -DVERSION=\"2.03\" -DXS_VERSION=\"2.03\" -fPIC "-I../../.."   TW.c
Processing Scripts.txt
rm -f ../../../lib/auto/Encode/TW/TW.so
gcc  -shared -O2 -L/usr/local/lib -fstack-protector TW.o bi_00_t.o bi_01_t.o cp_02_t.o ma_03_t.o  -o ../../../lib/auto/Encode/TW/TW.so  \
	      \
	  
chmod 755 ../../../lib/auto/Encode/TW/TW.so
make[2]: Leaving directory `<http://perl5.git.perl.org:8080/job/perl5-threaded/ws/cpan/Encode/TW'>
Processing DNormalizationProps.txt
make[2]: Entering directory `<http://perl5.git.perl.org:8080/job/perl5-threaded/ws/cpan/Encode/Unicode'>
"../../../miniperl" "-I../../../lib" "../../../lib/ExtUtils/xsubpp"  -typemap '<http://perl5.git.perl.org:8080/job/perl5-threaded/ws/cpan/Encode/Unicode/../../../lib/ExtUtils/typemap'>  Unicode.xs > Unicode.xsc
Running Mkbootstrap for Unicode ()
chmod 644 "Unicode.bs"
<http://perl5.git.perl.org:8080/job/perl5-threaded/ws/cpan/Encode/Unicode/../../../miniperl> "-I../../../lib" -MExtUtils::Command::MM -e 'cp_nonempty' -- Unicode.bs ../../../lib/auto/Encode/Unicode/Unicode.bs 644
mv Unicode.xsc Unicode.c
ccache gcc -c -I./Encode  -I../Encode -D_REENTRANT -D_GNU_SOURCE -fwrapv -fno-strict-aliasing -pipe -fstack-protector -I/usr/local/include -D_LARGEFILE_SOURCE -D_FILE_OFFSET_BITS=64 -D_FORTIFY_SOURCE=2 -Wall -Werror=declaration-after-statement -Wextra -Wc++-compat -Wwrite-strings -O2   -DVERSION=\"2.15\" -DXS_VERSION=\"2.15\" -fPIC "-I../../.."   Unicode.c
Unicode.xs: In function ‘XS_Encode__Unicode_decode_xs’:
Unicode.xs:187: warning: value computed is not used
Unicode.xs: In function ‘XS_Encode__Unicode_encode_xs’:
Unicode.xs:352: warning: value computed is not used
rm -f ../../../lib/auto/Encode/Unicode/Unicode.so
gcc  -shared -O2 -L/usr/local/lib -fstack-protector Unicode.o  -o ../../../lib/auto/Encode/Unicode/Unicode.so  \
	      \
	  
chmod 755 ../../../lib/auto/Encode/Unicode/Unicode.so
make[2]: Leaving directory `<http://perl5.git.perl.org:8080/job/perl5-threaded/ws/cpan/Encode/Unicode'>
make[1]: Leaving directory `<http://perl5.git.perl.org:8080/job/perl5-threaded/ws/cpan/Encode'>
Processing DAge.txt
Processing HangulSyllableType.txt
Processing auxiliary/WordBreakProperty.txt
Processing auxiliary/GraphemeBreakProperty.txt
Processing auxiliary/GCBTest.txt
Processing auxiliary/SBTest.txt
Processing auxiliary/WBTest.txt
Processing auxiliary/SentenceBreakProperty.txt
Processing NamedSequences.txt
Processing NameAliases.txt
rm -f ../../lib/auto/XS/APItest/APItest.so
gcc  -shared -O2 -L/usr/local/lib -fstack-protector APItest.o XSUB-undef-XS_VERSION.o XSUB-redefined-macros.o core.o exception.o notcore.o  -o ../../lib/auto/XS/APItest/APItest.so  \
	      \
	  
Processing auxiliary/LBTest.txt
chmod 755 ../../lib/auto/XS/APItest/APItest.so
make[1]: Leaving directory `<http://perl5.git.perl.org:8080/job/perl5-threaded/ws/ext/XS-APItest'>
Processing ScriptExtensions.txt
Processing IndicSyllabicCategory.txt
Processing BidiBrackets.txt
Processing IndicPositionalCategory.txt
Finishing processing Unicode properties
Compiling Perl properties
Creating Perl synonyms
Writing tables
Making pod file
Making test script
Updating 'mktables.lst'
Build step 'Execute shell' marked build as failure



nntp.perl.org: Perl Programming lists via nntp and http.
Comments to Ask Bjørn Hansen at ask@perl.org | Group listing | About