develooper Front page | perl.perl5.porters | Postings from September 2016

Smoke [blead] v5.25.4-129-g6ad1523 FAIL(X) os/390 25.00 (2964/)

From:
Yaroslav Kuzmin
Date:
September 15, 2016 10:04
Subject:
Smoke [blead] v5.25.4-129-g6ad1523 FAIL(X) os/390 25.00 (2964/)
Message ID:
1473933820.28843.13.camel@rocketsoftware.com

Smoke logs available at   https://drive.google.com/file/d/0B5PTttxwo7qAbTVTR1BWSW1IZWs

Automated smoke report for branch blead 5.25.5 patch 6ad15231b493b02c8de67d569c41b9403c64c934
v5.25.4-129-g6ad1523
RS12: 2964 (2964/)
    on        os/390 - 25.00
    using     c99 version
    smoketime 15 hours 4 minutes (average 7 hours 32 minutes)

Summary: FAIL(X)

O = OK  F = Failure(s), extended report at the bottom
X = Failure(s) under TEST but not under harness
? = still running or test results not (yet) available
Build failures during:       - = unknown or N/A
c = Configure, m = make, M = make (after miniperl), t = make test-prep

v5.25.4-129-g6ad1523  Configuration (common) none
----------- ---------------------------------------------------------
X X X X     -Dusedl
>
> >
> > >
> > > +----- PERLIO = perlio -DDEBUGGING
> > +------- PERLIO = stdio  -DDEBUGGING
> +--------- PERLIO = perlio
+----------- PERLIO = stdio


Locally applied patches:
    SMOKE6ad15231b493b02c8de67d569c41b9403c64c934

Tests skipped on user request:
    # One test name on a line
Failures: (common-args) none
[stdio] -Dusedl
Inconsistent test results (between TEST and harness):
    ../lib/utf8.t........................... ......................................................
FAILED at test 185
    ../t/op/chop.t.......................... .....................................................
FAILED at test 140
    ../lib/warnings.t....................... ..................................................
FAILED at test 513

[perlio] -Dusedl
Inconsistent test results (between TEST and harness):
    ../lib/utf8.t........................... ......................................................
FAILED at test 185
    ../lib/warnings.t....................... ..................................................
FAILED at test 513
    ../t/op/chop.t.......................... .....................................................
FAILED at test 140

[stdio/perlio] -DDEBUGGING -Dusedl
Inconsistent test results (between TEST and harness):
    ../t/op/chop.t.......................... .....................................................
FAILED at test 140
    ../lib/warnings.t....................... ..................................................
FAILED at test 513
    ../lib/utf8.t........................... ......................................................
FAILED at test 185

Compiler messages(os390):



--
Report by Test::Smoke v1.6 running on perl 5.22.0
(Reporter v0.052 / Smoker v0.045)


--

Regards,

Yaroslav Kuzmin
Developer C/C++ ,z/OS , Linux
3 Zhukovskiy Street · Miass, Chelyabinsk region 456318 · Russia
Tel:  +7.922.2.38.33.38
Email: YKuzmin@rocketsoftware.com
Web: www.rocketsoftware.com
================================
Rocket Software, Inc. and subsidiaries ■ 77 Fourth Avenue, Waltham MA 02451 ■ +1 877.328.2932 ■ +1 781.577.4321
Unsubscribe from Marketing Messages/Manage Your Subscription Preferences - http://www.rocketsoftware.com/manage-your-email-preferences
Privacy Policy - http://www.rocketsoftware.com/company/legal/privacy-policy
================================

This communication and any attachments may contain confidential information of Rocket Software, Inc. All unauthorized use, disclosure or distribution is prohibited. If you are not the intended recipient, please notify Rocket Software immediately and destroy all copies of this communication. Thank you.



nntp.perl.org: Perl Programming lists via nntp and http.
Comments to Ask Bjørn Hansen at ask@perl.org | Group listing | About