develooper Front page | perl.perl5.porters | Postings from September 2016

Smoke [maint-5.22] v5.22.3-RC3-8-g7dcf3bc FAIL(X) os/390 25.00(2964/)

From:
Yaroslav Kuzmin
Date:
September 1, 2016 04:55
Subject:
Smoke [maint-5.22] v5.22.3-RC3-8-g7dcf3bc FAIL(X) os/390 25.00(2964/)
Message ID:
1472705690.15440.1.camel@rocketsoftware.com

Smoke logs available at   https://drive.google.com/file/d/0B5PTttxwo7qAZWtRRDdRWUZhMms

Automated smoke report for branch maint-5.22 5.22.3 patch 7dcf3bc3ee350af138b66fb3d77ddaaa9e7f0c38
v5.22.3-RC3-8-g7dcf3bc
RS12: 2964 (2964/)
    on        os/390 - 25.00
    using     c99 version
    smoketime 16 hours 23 minutes (average 8 hours 11 minutes)

Summary: FAIL(X)

O = OK  F = Failure(s), extended report at the bottom
X = Failure(s) under TEST but not under harness
? = still running or test results not (yet) available
Build failures during:       - = unknown or N/A
c = Configure, m = make, M = make (after miniperl), t = make test-prep

v5.22.3-RC3-8-g7dcf3bc  Configuration (common) none
----------- ---------------------------------------------------------
X X X X     -Dusedl
>
> >
> > >
> > > +----- PERLIO = perlio -DDEBUGGING
> > +------- PERLIO = stdio  -DDEBUGGING
> +--------- PERLIO = perlio
+----------- PERLIO = stdio


Locally applied patches:
    SMOKE7dcf3bc3ee350af138b66fb3d77ddaaa9e7f0c38

Tests skipped on user request:
    # One test name on a line
Failures: (common-args) none
[stdio] -Dusedl
Inconsistent test results (between TEST and harness):
    ../ext/DynaLoader/t/DynaLoader.t........ ................................... FAILED at test 20
    ../ext/XS-APItest/t/cophh.t............. ........................................ FAILED
--expected 2 tests, saw 0
    ../lib/ExtUtils/t/Embed.t............... .......................................... FAILED at
test 1
    ../ext/File-Glob/t/rt114984.t........... ...................................... FAILED at test 1
    ../t/porting/maintainers.t.............. ......................................... FAILED at
test 8216
    ../t/dist/ExtUtils-CBuilder/t/02-link.t. .............................. FAILED at test 5
    ../ext/XS-APItest/t/svpeek.t............ ....................................... FAILED at test
39
    ../ext/XS-APItest/t/svpv_magic.t........ ................................... FAILED at test 6
    ../ext/XS-APItest/t/hash.t.............. ......................................... FAILED at
test 910
    ../ext/XS-APItest/t/svcat.t............. ........................................ FAILED at test
1
    ../t/re/pat.t........................... ......................................................
FAILED at test 771

[perlio] -Dusedl
Inconsistent test results (between TEST and harness):
    ../ext/DynaLoader/t/DynaLoader.t........ ................................... FAILED at test 20
    ../ext/XS-APItest/t/cophh.t............. ........................................ FAILED
--expected 2 tests, saw 0
    ../ext/File-Glob/t/rt114984.t........... ...................................... FAILED at test 1
    ../t/dist/ExtUtils-CBuilder/t/02-link.t. .............................. FAILED at test 5
    ../t/porting/maintainers.t.............. ......................................... FAILED at
test 8216
    ../lib/ExtUtils/t/Embed.t............... .......................................... FAILED at
test 1
    ../ext/XS-APItest/t/svpeek.t............ ....................................... FAILED at test
39
    ../ext/XS-APItest/t/svcat.t............. ........................................ FAILED at test
1
    ../t/re/pat.t........................... ......................................................
FAILED at test 771
    ../ext/XS-APItest/t/hash.t.............. ......................................... FAILED at
test 910
    ../ext/XS-APItest/t/svpv_magic.t........ ................................... FAILED at test 6

[stdio] -DDEBUGGING -Dusedl
Inconsistent test results (between TEST and harness):
    ../lib/ExtUtils/t/Embed.t............... .......................................... FAILED at
test 1
    ../ext/File-Glob/t/rt114984.t........... ...................................... FAILED at test 1
    ../t/re/speed.t......................... ....................................................
FAILED--expected 25 tests, saw 4
    ../t/porting/maintainers.t.............. ......................................... FAILED at
test 8216
    ../t/dist/ExtUtils-CBuilder/t/02-link.t. .............................. FAILED at test 5
    ../ext/DynaLoader/t/DynaLoader.t........ ................................... FAILED at test 20
    ../ext/XS-APItest/t/cophh.t............. ........................................ FAILED
--expected 2 tests, saw 0
    ../ext/XS-APItest/t/svpv_magic.t........ ................................... FAILED at test 6
    ../ext/XS-APItest/t/hash.t.............. ......................................... FAILED at
test 910
    ../ext/XS-APItest/t/svcat.t............. ........................................ FAILED at test
1
    ../t/re/pat.t........................... ......................................................
FAILED at test 771
    ../ext/XS-APItest/t/svpeek.t............ ....................................... FAILED at test
39

[perlio] -DDEBUGGING -Dusedl
Inconsistent test results (between TEST and harness):
    ../ext/XS-APItest/t/svpeek.t............ ....................................... FAILED at test
39
    ../ext/XS-APItest/t/svpv_magic.t........ ................................... FAILED at test 6
    ../ext/XS-APItest/t/hash.t.............. ......................................... FAILED at
test 910
    ../ext/XS-APItest/t/svcat.t............. ........................................ FAILED at test
1
    ../t/re/pat.t........................... ......................................................
FAILED at test 771
    ../ext/DynaLoader/t/DynaLoader.t........ ................................... FAILED at test 20
    ../ext/XS-APItest/t/cophh.t............. ........................................ FAILED
--expected 2 tests, saw 0
    ../lib/ExtUtils/t/Embed.t............... .......................................... FAILED at
test 1
    ../ext/File-Glob/t/rt114984.t........... ...................................... FAILED at test 1
    ../t/porting/maintainers.t.............. ......................................... FAILED at
test 8216
    ../t/dist/ExtUtils-CBuilder/t/02-link.t. .............................. FAILED at test 5

Compiler messages(os390):



--
Report by Test::Smoke v1.6 running on perl 5.22.0
(Reporter v0.052 / Smoker v0.045)

--

Regards,

Yaroslav Kuzmin
Developer C/C++ ,z/OS , Linux
3 Zhukovskiy Street · Miass, Chelyabinsk region 456318 · Russia
Tel:  +7.922.2.38.33.38
Email: YKuzmin@rocketsoftware.com
Web: www.rocketsoftware.com


================================
Rocket Software, Inc. and subsidiaries ■ 77 Fourth Avenue, Waltham MA 02451 ■ +1 877.328.2932 ■ +1 781.577.4321
Unsubscribe From Commercial Email – unsubscribe@rocketsoftware.com
Manage Your Subscription Preferences - http://info.rocketsoftware.com/GlobalSubscriptionManagementEmailFooter_SubscriptionCenter.html
Privacy Policy - http://www.rocketsoftware.com/company/legal/privacy-policy
================================

This communication and any attachments may contain confidential information of Rocket Software, Inc. All unauthorized use, disclosure or distribution is prohibited. If you are not the intended recipient, please notify Rocket Software immediately and destroy all copies of this communication. Thank you.



nntp.perl.org: Perl Programming lists via nntp and http.
Comments to Ask Bjørn Hansen at ask@perl.org | Group listing | About