develooper Front page | perl.perl5.porters | Postings from September 2016

Smoke [blead] v5.25.4-29-gc333712 FAIL(F) MSWin32 Win2000 SP4 (x86/1cpu) {blead}

From:
George Greer
Date:
September 1, 2016 01:37
Subject:
Smoke [blead] v5.25.4-29-gc333712 FAIL(F) MSWin32 Win2000 SP4 (x86/1cpu) {blead}
Message ID:
20160901013713.5A0424E0C00@zwei.m-l.org
Smoke logs available at http://m-l.org/~perl/smoke/perl/win32/blead/logc333712c4a550eeb3146b964d8508f772e294a49.log.gz

Known failures on Win32:

../t/win32/popen.t..........................................FAILED
    Non-zero exit status: 9
    No plan found in TAP output

../cpan/Time-HiRes/t/usleep.t...............................FAILED
    3
    Non-zero exit status: 1

../t/op/threads.t...........................................FAILED
    Non-zero exit status: 9
    Bad plan.  You planned 27 tests but ran 9.

../cpan/IPC-Cmd/t/01_IPC-Cmd.t..............................FAILED
    27-28
    42
    115-116
    Non-zero exit status: 2

Automated smoke report for 5.25.5 patch c333712c4a550eeb3146b964d8508f772e294a49 v5.25.4-29-gc333712
perl-win2k: Intel(R) Core(TM) i7 CPU 920 @ 2.67GHz(~2672 MHz) (x86/1 cpu)
    on        MSWin32 - Win2000 SP4
    using     cl version 14.00.50727.762
    smoketime 2 hours 11 minutes (average 32 minutes 50 seconds)

Summary: FAIL(F)

O = OK  F = Failure(s), extended report at the bottom
X = Failure(s) under TEST but not under harness
? = still running or test results not (yet) available
Build failures during:       - = unknown or N/A
c = Configure, m = make, M = make (after miniperl), t = make test-prep

v5.25.4-29-gc333712  Configuration (common) none
----------- ---------------------------------------------------------
F F         
O O         -Duseithreads
| +--------- -DDEBUGGING
+----------- no debugging


Locally applied patches:
    SMOKEc333712c4a550eeb3146b964d8508f772e294a49

Failures: (common-args) none
[default] 
[default] -DDEBUGGING
../cpan/ExtUtils-MakeMaker/t/02-xsdynamic.t.................FAILED
    17, 22, 35, 40
    Non-zero exit status: 4

Passed Todo tests: (common-args) none
[default] 
[default] -DDEBUGGING
[default] -Duseithreads
[default] -DDEBUGGING -Duseithreads
../cpan/Archive-Tar/t/09_roundtrip.t........................PASSED
    1, 4, 6
../ext/IPC-Open3/t/IPC-Open3.t..............................PASSED
    25

Compiler messages(MSWin32):
..\pp_sys.c(4647) : warning C4244: 'initializing' : conversion from 'time_t' to 'IV', possible loss of data
..\pp_sys.c(4850) : warning C4244: 'initializing' : conversion from 'time_t' to 'IV', possible loss of data
MD5.xs(763) : warning C4244: '=' : conversion from 'U32' to 'char', possible loss of data
MD5.xs(764) : warning C4244: '=' : conversion from 'U32' to 'char', possible loss of data
MD5.xs(765) : warning C4244: '=' : conversion from 'U32' to 'char', possible loss of data
MD5.xs(766) : warning C4244: '=' : conversion from 'U32' to 'char', possible loss of data
# Test.obj : error LNK2001: unresolved external symbol _PL_markstack_ptr
# Test.obj : error LNK2001: unresolved external symbol _PL_stack_sp
# Test.obj : error LNK2001: unresolved external symbol _PL_tainted
# Test.obj : error LNK2001: unresolved external symbol _PL_op
# Test.obj : error LNK2001: unresolved external symbol _PL_curpad
# Test.obj : error LNK2001: unresolved external symbol _PL_stack_base
# blib\arch\auto\XS\Test\Test.dll : fatal error LNK1120: 6 unresolved externals
# NMAKE : fatal error U1077: '"C:\Program Files\Microsoft Visual Studio 8\VC\BIN\link.EXE"' : return code '0x460'
# Other.obj : error LNK2001: unresolved external symbol _PL_markstack_ptr
# Other.obj : error LNK2001: unresolved external symbol _PL_stack_sp
# Other.obj : error LNK2001: unresolved external symbol _PL_tainted
# Other.obj : error LNK2001: unresolved external symbol _PL_op
# Other.obj : error LNK2001: unresolved external symbol _PL_curpad
# Other.obj : error LNK2001: unresolved external symbol _PL_stack_base
# blib\arch\auto\XS\Other\Other.dll : fatal error LNK1120: 6 unresolved externals
# Test.obj : error LNK2001: unresolved external symbol _PL_markstack
# Test.obj : error LNK2001: unresolved external symbol _PL_debug
# blib\arch\auto\XS\Test\Test.dll : fatal error LNK1120: 7 unresolved externals
# Other.obj : error LNK2001: unresolved external symbol _PL_markstack
# Other.obj : error LNK2001: unresolved external symbol _PL_debug
# blib\arch\auto\XS\Other\Other.dll : fatal error LNK1120: 7 unresolved externals
d:\smoke\perl\blead\build\win32\vdir.h(649) : warning C4244: 'argument' : conversion from 'const WCHAR' to 'char', possible loss of data
-- 
Report by Test::Smoke v1.53 build 1374 running on perl 5.10.0
(Reporter v0.050 / Smoker v0.045)




nntp.perl.org: Perl Programming lists via nntp and http.
Comments to Ask Bjørn Hansen at ask@perl.org | Group listing | About