develooper Front page | perl.perl5.porters | Postings from July 2016

Smoke [blead] v5.25.3-42-gec2bccf FAIL(F) linux 4.4.0-30-generic[debian] (x86_64/8 cpu) {blead_g++_quick}

From:
George Greer
Date:
July 28, 2016 14:55
Subject:
Smoke [blead] v5.25.3-42-gec2bccf FAIL(F) linux 4.4.0-30-generic[debian] (x86_64/8 cpu) {blead_g++_quick}
Message ID:
20160728145531.AD9434E0002@zwei.m-l.org
Smoke logs available at http://m-l.org/~perl/smoke/perl/linux/blead_g++_quick/logec2bccfd3800c851677f4f30f680a9734ee6552f.log.gz

Automated smoke report for 5.25.4 patch ec2bccfd3800c851677f4f30f680a9734ee6552f v5.25.3-42-gec2bccf
zwei: Intel(R) Core(TM) i7 CPU 920 @ 2.67GHz (GenuineIntel 2668MHz) (x86_64/8 cpu)
    on        linux - 4.4.0-30-generic [debian]
    using     g++ version 5.4.0 20160609
    smoketime 35 minutes 6 seconds (average 8 minutes 46 seconds)

Summary: FAIL(F)

O = OK  F = Failure(s), extended report at the bottom
X = Failure(s) under TEST but not under harness
? = still running or test results not (yet) available
Build failures during:       - = unknown or N/A
c = Configure, m = make, M = make (after miniperl), t = make test-prep

v5.25.3-42-gec2bccf  Configuration (common) -Accflags=-DPERL_POISON -Dcc=g++
----------- ---------------------------------------------------------
F F         
F F         -Duseithreads
| +--------- -DDEBUGGING
+----------- no debugging


Locally applied patches:
    SMOKEec2bccfd3800c851677f4f30f680a9734ee6552f

Testsuite was run only with 'harness'

Failures: (common-args) -Accflags=-DPERL_POISON -Dcc=g++
[default] 
[default] -DDEBUGGING
../t/porting/checkcfgvar.t..................................FAILED
    2, 4, 8, 10, 12, 14, 16, 18, 20, 22
../t/porting/regen.t........................................FAILED
    7

[default] -Duseithreads
[default] -DDEBUGGING -Duseithreads
../t/porting/checkcfgvar.t..................................FAILED
    2, 4, 8, 10, 12, 14, 16, 18, 20, 22
../t/porting/regen.t........................................FAILED
    3

Passed Todo tests: (common-args) -Accflags=-DPERL_POISON -Dcc=g++
[default] 
[default] -DDEBUGGING
[default] -Duseithreads
[default] -DDEBUGGING -Duseithreads
../cpan/Archive-Tar/t/09_roundtrip.t........................PASSED
    1, 4, 6

Compiler messages(gcc):
inflate.c:1487:9: warning: unused parameter ‘subvert’ [-Wunused-parameter]
-- 
Report by Test::Smoke v1.53 build 1374 running on perl 5.22.1
(Reporter v0.050 / Smoker v0.045)




nntp.perl.org: Perl Programming lists via nntp and http.
Comments to Ask Bjørn Hansen at ask@perl.org | Group listing | About