develooper Front page | perl.perl5.porters | Postings from April 2016

Smoke [5.22.2] v5.22.1-122-g32f0645 FAIL(M) linux 4.1.20-v7+[debian] (armv7l/4 cpu)

From:
njh
Date:
April 8, 2016 05:17
Subject:
Smoke [5.22.2] v5.22.1-122-g32f0645 FAIL(M) linux 4.1.20-v7+[debian] (armv7l/4 cpu)
Message ID:
201604080516.u385GHMd000585@compaq.bandsman.co.uk
Automated smoke report for 5.22.2 patch 32f0645d6fb4ef9e64ebbdaa14fbc6a1b1a89301 v5.22.1-122-g32f0645
pi2.bandsman.co.uk: ARMv7 Processor rev 5 (v7l) ( 0MHz) (armv7l/4 cpu)
    on        linux - 4.1.20-v7+ [debian]
    using     cc version 4.9.2
    smoketime 1 hour 52 minutes (average 56 minutes 1 seconds)

Summary: FAIL(M)

O = OK  F = Failure(s), extended report at the bottom
X = Failure(s) under TEST but not under harness
? = still running or test results not (yet) available
Build failures during:       - = unknown or N/A
c = Configure, m = make, M = make (after miniperl), t = make test-prep

v5.22.1-122-g32f0645  Configuration (common) none
----------- ---------------------------------------------------------
M -         -Accflags="-O2 -W -Wformat=2 -Wswitch -Wshadow -Wwrite-strings -Wuninitialized -Wall -pipe -fomit-frame-pointer -D_FORTIFY_SOURCE=2 -Wpointer-arith -Wstrict-prototypes -fstack-protector -Wstack-protector -Wextra -Wbad-function-cast -Wcast-align -Wdisabled-optimization -Wendif-labels -Wfloat-equal -Wformat-nonliteral -Winline -Wmissing-declarations -Wmissing-prototypes -Wpointer-arith -Wundef -Wformat-security -pedantic" -Duseithreads
O -         -Accflags="-O2 -W -Wformat=2 -Wswitch -Wshadow -Wwrite-strings -Wuninitialized -Wall -pipe -fomit-frame-pointer -D_FORTIFY_SOURCE=2 -Wpointer-arith -Wstrict-prototypes -fstack-protector -Wstack-protector -Wextra -Wbad-function-cast -Wcast-align -Wdisabled-optimization -Wendif-labels -Wfloat-equal -Wformat-nonliteral -Winline -Wmissing-declarations -Wmissing-prototypes -Wpointer-arith -Wundef -Wformat-security" -Duseithreads
| +--------- -DDEBUGGING
+----------- no debugging


Locally applied patches:
    SMOKE32f0645d6fb4ef9e64ebbdaa14fbc6a1b1a89301

Compiler messages(gcc):
Configure ...try.c: In function ‘main’:
try.c: In function ‘main’:
try.c: In function ‘blech’:
try.c: In function ‘blech_in_list’:
try.c: In function ‘bletch’:
signal.c:8:5: warning: function declaration isn’t a prototype [-Wstrict-prototypes]
hv_func.h: In function ‘S_perl_hash_siphash_2_4’:
hv_func.h:213:17: warning: cast increases required alignment of target type [-Wcast-align]
hv_func.h:214:17: warning: cast increases required alignment of target type [-Wcast-align]
hv_func.h: In function ‘S_perl_hash_superfast’:
hv_func.h:272:18: warning: cast increases required alignment of target type [-Wcast-align]
hv_func.h: In function ‘S_perl_hash_murmur3’:
hv_func.h:376:16: warning: cast increases required alignment of target type [-Wcast-align]
hv_func.h:121:31: warning: cast increases required alignment of target type [-Wcast-align]
hv_func.h: In function ‘S_perl_hash_djb2’:
hv_func.h:470:18: warning: cast increases required alignment of target type [-Wcast-align]
hv_func.h: In function ‘S_perl_hash_sdbm’:
hv_func.h:480:18: warning: cast increases required alignment of target type [-Wcast-align]
hv_func.h: In function ‘S_perl_hash_one_at_a_time’:
hv_func.h:506:18: warning: cast increases required alignment of target type [-Wcast-align]
hv_func.h: In function ‘S_perl_hash_one_at_a_time_hard’:
hv_func.h:521:18: warning: cast increases required alignment of target type [-Wcast-align]
hv_func.h: In function ‘S_perl_hash_old_one_at_a_time’:
hv_func.h:556:18: warning: cast increases required alignment of target type [-Wcast-align]
op.c: In function ‘Perl_Slab_Alloc’:
op.h:687:6: warning: cast increases required alignment of target type [-Wcast-align]
op.c: In function ‘Perl_Slab_Free’:
perl.h:165:22: warning: declaration of ‘my_perl’ shadows a global declaration [-Wshadow]
miniperlmain.c:49:25: warning: shadowed declaration is here [-Wshadow]
op.c: In function ‘Perl_op_free’:
op.c:813:6: warning: no previous prototype for ‘S_op_clear_gv’ [-Wmissing-prototypes]
op.c: In function ‘S_forget_pmop’:
op.c:1133:27: warning: cast increases required alignment of target type [-Wcast-align]
op.c:1416:1: warning: no previous prototype for ‘S_op_sibling_newUNOP’ [-Wmissing-prototypes]
op.c:1434:1: warning: no previous prototype for ‘S_alloc_LOGOP’ [-Wmissing-prototypes]
op.c: In function ‘Perl_scalarvoid’:
op.c:1980:61: warning: comparing floating point with == or != is unsafe [-Wfloat-equal]
op.c:1980:74: warning: comparing floating point with == or != is unsafe [-Wfloat-equal]
perl.c: In function ‘perl_destruct’:
perl.c:549:17: warning: declaration of ‘i’ shadows a previous local [-Wshadow]
perl.c:532:9: warning: shadowed declaration is here [-Wshadow]
op.c:2315:1: warning: no previous prototype for ‘S_check_hash_fields_and_hekify’ [-Wmissing-prototypes]
cop.h:98:10: warning: declaration of ‘i’ shadows a previous local [-Wshadow]
cop.h:112:10: warning: declaration of ‘i’ shadows a previous local [-Wshadow]
perl.c:833:6: warning: declaration of ‘i’ shadows a previous local [-Wshadow]
perl.c:870:6: warning: declaration of ‘i’ shadows a previous local [-Wshadow]
handy.h:64:35: warning: declaration of ‘_p’ shadows a previous local [-Wshadow]
handy.h:64:35: warning: shadowed declaration is here [-Wshadow]
op.c: In function ‘Perl_op_lvalue_flags’:
op.c:2828:7: warning: declaration of ‘kid’ shadows a previous local [-Wshadow]
perl.c:1207:13: warning: declaration of ‘i’ shadows a previous local [-Wshadow]
op.c:2785:9: warning: shadowed declaration is here [-Wshadow]
gv.c: In function ‘S_gv_fetchmeth_internal’:
gv.c:802:29: warning: declaration of ‘hvname’ shadows a previous local [-Wshadow]
gv.c:705:17: warning: shadowed declaration is here [-Wshadow]
op.c: In function ‘S_fold_constants’:
op.c:4310:17: warning: declaration of ‘sv’ shadows a previous local [-Wshadow]
op.c:4262:14: warning: shadowed declaration is here [-Wshadow]
op.c:4334:15: warning: declaration of ‘type’ shadows a previous local [-Wshadow]
op.c:4260:13: warning: shadowed declaration is here [-Wshadow]
perl.c: In function ‘Perl_eval_pv’:
sv.h:1753:32: warning: comparing floating point with == or != is unsafe [-Wfloat-equal]
perl.c: In function ‘Perl_require_pv’:
pp.h:69:19: warning: declaration of ‘sp’ shadows a previous local [-Wshadow]
pp.h:69:19: warning: shadowed declaration is here [-Wshadow]
op.c: In function ‘S_pmtrans’:
perl.c: In function ‘S_init_main_stash’:
op.c: In function ‘Perl_newPMOP’:
op.c:5416:22: warning: cast increases required alignment of target type [-Wcast-align]
op.c: In function ‘Perl_pmruntime’:
op.c:5491:6: warning: declaration of ‘o’ shadows a parameter [-Wshadow]
op.c:5467:26: warning: shadowed declaration is here [-Wshadow]
op.c:5519:6: warning: declaration of ‘o’ shadows a parameter [-Wshadow]
op.c: In function ‘Perl_utilize’:
op.c:6023:10: warning: declaration of ‘pack’ shadows a previous local [-Wshadow]
perl.c: In function ‘Perl_init_debugger’:
op.c:6004:9: warning: shadowed declaration is here [-Wshadow]
perl.c: In function ‘S_init_predump_symbols’:
op.c: In function ‘S_new_logop’:
op.c: In function ‘Perl_newCONDOP’:
op.c: In function ‘Perl_newLOOPOP’:
perl.c: In function ‘S_init_postdump_symbols’:
perl.c:4345:26: warning: declaration of ‘nlen’ shadows a previous local [-Wshadow]
perl.c:4301:18: warning: shadowed declaration is here [-Wshadow]
hv.h:365:25: warning: cast increases required alignment of target type [-Wcast-align]
op.c: In function ‘Perl_newWHILEOP’:
op.c: In function ‘Perl_newFOROP’:
op.c: In function ‘Perl_cv_const_sv’:
op.c: In function ‘Perl_cv_const_sv_or_av’:
op.c: In function ‘Perl_newMYSUB’:
hv.h:448:10: warning: cast increases required alignment of target type [-Wcast-align]
op.c: In function ‘Perl_newATTRSUB_x’:
gv.c: In function ‘Perl_gv_check’:
gv.c: In function ‘Perl_magic_freeovrld’:
gv.c:2591:24: warning: cast increases required alignment of target type [-Wcast-align]
gv.c: In function ‘Perl_Gv_AMupdate’:
gv.c:2628:32: warning: cast increases required alignment of target type [-Wcast-align]
op.c: In function ‘S_clear_special_blocks’:
op.c: In function ‘S_process_special_blocks’:
gv.c: In function ‘Perl_gv_handler’:
gv.c:2807:12: warning: cast increases required alignment of target type [-Wcast-align]
gv.c: In function ‘Perl_try_amagic_bin’:
gv.c:2915:13: warning: declaration of ‘left’ shadows a previous local [-Wshadow]
gv.c:2884:15: warning: shadowed declaration is here [-Wshadow]
gv.c: In function ‘Perl_amagic_call’:
gv.c:3018:36: warning: cast increases required alignment of target type [-Wcast-align]
gv.c:3019:22: warning: cast increases required alignment of target type [-Wcast-align]
gv.c:3141:31: warning: cast increases required alignment of target type [-Wcast-align]
gv.c:3142:16: warning: cast increases required alignment of target type [-Wcast-align]
op.c: In function ‘Perl_ck_spair’:
op.c:9594:19: warning: declaration of ‘type’ shadows a previous local [-Wshadow]
op.c:9588:15: warning: shadowed declaration is here [-Wshadow]
op.c: In function ‘Perl_ck_rvconst’:
gv.c: In function ‘Perl_gv_try_downgrade’:
gv.c:3575:14: warning: cast increases required alignment of target type [-Wcast-align]
op.c: In function ‘Perl_ck_sort’:
op.c:10921:6: warning: declaration of ‘kid’ shadows a previous local [-Wshadow]
toke.c: In function ‘Perl_lex_start’:
op.c:10898:9: warning: shadowed declaration is here [-Wshadow]
toke.c: In function ‘Perl_parser_free_nexttoke_ops’:
op.c: In function ‘Perl_rv2cv_op_cv’:
toke.c: In function ‘S_incline’:
op.c:12247:1: warning: no previous prototype for ‘S_maybe_multideref’ [-Wmissing-prototypes]
toke.c: In function ‘S_get_and_check_backslash_N_name’:
toke.c:2674:19: warning: declaration of ‘first_bad_char_loc’ shadows a previous local [-Wshadow]
toke.c:2512:15: warning: shadowed declaration is here [-Wshadow]
toke.c: In function ‘S_scan_const’:
toke.c:3411:41: warning: declaration of ‘len’ shadows a previous local [-Wshadow]
toke.c:3373:28: warning: shadowed declaration is here [-Wshadow]
perl.h:1581:52: warning: declaration of ‘len’ shadows a previous local [-Wshadow]
toke.c:3411:41: warning: shadowed declaration is here [-Wshadow]
toke.c:3441:37: warning: declaration of ‘uv’ shadows a previous local [-Wshadow]
toke.c:2846:8: warning: shadowed declaration is here [-Wshadow]
toke.c:3464:50: warning: declaration of ‘off’ shadows a previous local [-Wshadow]
toke.c:3389:21: warning: shadowed declaration is here [-Wshadow]
toke.c:3465:41: warning: declaration of ‘uv’ shadows a previous local [-Wshadow]
toke.c:3441:37: warning: shadowed declaration is here [-Wshadow]
op.c: In function ‘Perl_wrap_op_checker’:
op.c:14459:35: warning: declaration of ‘opcode’ shadows a global declaration [-Wshadow]
opnames.h:414:3: warning: shadowed declaration is here [-Wshadow]
op.c: In function ‘const_sv_xsub’:
op.c: In function ‘const_av_xsub’:
toke.c: In function ‘Perl_yylex’:
toke.c:6082:12: warning: declaration of ‘len’ shadows a previous local [-Wshadow]
toke.c:4300:12: warning: shadowed declaration is here [-Wshadow]
toke.c:6368:13: warning: declaration of ‘gv’ shadows a previous local [-Wshadow]
toke.c:4310:9: warning: shadowed declaration is here [-Wshadow]
toke.c:6537:7: warning: declaration of ‘cv’ shadows a previous local [-Wshadow]
toke.c:6417:6: warning: shadowed declaration is here [-Wshadow]
toke.c:6985:10: warning: declaration of ‘gv’ shadows a previous local [-Wshadow]
toke.c:7580:25: warning: declaration of ‘len’ shadows a previous local [-Wshadow]
toke.c:7580:25: warning: shadowed declaration is here [-Wshadow]
toke.c:7706:8: warning: declaration of ‘sv’ shadows a previous local [-Wshadow]
toke.c:6416:6: warning: shadowed declaration is here [-Wshadow]
toke.c: In function ‘S_new_constant’:
toke.c: In function ‘S_scan_pat’:
toke.c:8988:7: warning: cast increases required alignment of target type [-Wcast-align]
toke.c: In function ‘Perl_start_subparse’:
gv.c: In function ‘core_xsub’:
inline.h:29:1: warning: inlining failed in call to ‘S_CvGV’: call is unlikely and code size would grow [-Winline]
gv.h:52:21: warning: called from here [-Winline]
gv.c: In function ‘Perl_gv_fetchpvn_flags’:
gv.c:1545:1: warning: inlining failed in call to ‘S_parse_gv_stash_name’: --param large-function-growth limit reached [-Winline]
embed.h:1493:46: warning: called from here [-Winline]
gv.c:1695:1: warning: inlining failed in call to ‘S_find_default_stash’: --param large-function-growth limit reached [-Winline]
embed.h:1484:41: warning: called from here [-Winline]
gv.c: In function ‘Perl_gv_fetchmeth_pv’:
gv.c:694:1: warning: inlining failed in call to ‘S_gv_fetchmeth_internal’: --param max-inline-insns-single limit reached [-Winline]
gv.c:662:5: warning: called from here [-Winline]
gv.c: In function ‘Perl_gv_fetchmeth_pvn’:
gv.c:862:5: warning: called from here [-Winline]
perly.y: In function ‘Perl_yyparse’:
gv.c: In function ‘Perl_gv_fetchmeth_sv’:
gv.c:643:9: warning: called from here [-Winline]
cv.h:52:18: warning: called from here [-Winline]
pad.c: In function ‘Perl_cv_undef_flags’:
pad.c: In function ‘Perl_cv_forget_slab’:
pad.c: In function ‘S_pad_alloc_name’:
pad.c: In function ‘Perl_pad_add_anon’:
pad.c: In function ‘S_pad_findlex’:
pad.c: In function ‘S_cv_clone_pad’:
pad.c: In function ‘S_cv_clone’:
pad.c: In function ‘Perl_pad_fixup_inner_anons’:
pad.c:2430:10: warning: declaration of ‘innercv’ shadows a previous local [-Wshadow]
pad.c:2400:8: warning: shadowed declaration is here [-Wshadow]
pad.c: In function ‘Perl_pad_push’:
pad.c: In function ‘Perl_padlist_dup’:
pad.c: In function ‘Perl_newPADNAMEpvn’:
pad.c:2802:13: warning: cast increases required alignment of target type [-Wcast-align]
pad.c: In function ‘Perl_newPADNAMEouter’:
pad.h:90:6: warning: cast increases required alignment of target type [-Wcast-align]
pad.c: In function ‘Perl_padname_free’:
pad.c: In function ‘Perl_padname_dup’:
inline_invlist.c: In function ‘S_invlist_array’:
inline_invlist.c:77:13: warning: cast increases required alignment of target type [-Wcast-align]
regcomp.c: In function ‘S_get_ANYOF_cp_list_for_ssc’:
regcomp.c: In function ‘S_make_trie’:
regcomp.c:2962:21: warning: declaration of ‘tmp’ shadows a previous local [-Wshadow]
regcomp.c:2951:34: warning: shadowed declaration is here [-Wshadow]
regcomp.c:2963:26: warning: declaration of ‘ch’ shadows a previous local [-Wshadow]
regcomp.c:2952:18: warning: shadowed declaration is here [-Wshadow]
regcomp.c:2983:28: warning: declaration of ‘len’ shadows a previous local [-Wshadow]
regcomp.c:2138:12: warning: shadowed declaration is here [-Wshadow]
regcomp.h:345:22: warning: cast increases required alignment of target type [-Wcast-align]
regcomp.c:3080:37: warning: cast increases required alignment of target type [-Wcast-align]
regcomp.c: In function ‘S_construct_ahocorasick_from_trie’:
handy.h:2061:43: warning: cast increases required alignment of target type [-Wcast-align]
regcomp.c: In function ‘S_study_chunk’:
regcomp.c:4092:34: warning: declaration of ‘last’ shadows a parameter [-Wshadow]
regcomp.c:3763:13: warning: shadowed declaration is here [-Wshadow]
regcomp.h:348:24: warning: cast increases required alignment of target type [-Wcast-align]
regcomp.c:5112:33: warning: cast increases required alignment of target type [-Wcast-align]
regcomp.c:5115:59: warning: cast increases required alignment of target type [-Wcast-align]
regcomp.c: In function ‘S_concat_pat’:
regcomp.c:5915:33: warning: declaration of ‘svp’ shadows a previous local [-Wshadow]
regcomp.c:5862:10: warning: shadowed declaration is here [-Wshadow]
regcomp.c:5963:17: warning: declaration of ‘sv’ shadows a previous local [-Wshadow]
regcomp.c:5876:13: warning: shadowed declaration is here [-Wshadow]
regcomp.c: In function ‘S_compile_runtime_code’:
cop.h:1128:26: warning: declaration of ‘p’ shadows a previous local [-Wshadow]
regcomp.c:6142:8: warning: shadowed declaration is here [-Wshadow]
cop.h:1154:27: warning: declaration of ‘p’ shadows a previous local [-Wshadow]
regcomp.c: In function ‘Perl_re_op_compile’:
regcomp.c:7370:28: warning: declaration of ‘scan’ shadows a previous local [-Wshadow]
regcomp.c:6398:14: warning: shadowed declaration is here [-Wshadow]
regcomp.h:956:40: warning: declaration of ‘re_debug_flags’ shadows a previous local [-Wshadow]
regcomp.h:956:40: warning: shadowed declaration is here [-Wshadow]
regcomp.c: In function ‘Perl_reg_named_buff_fetch’:
regcomp.c:7475:23: warning: cast increases required alignment of target type [-Wcast-align]
regcomp.c: In function ‘Perl_reg_named_buff_nextkey’:
regcomp.c:7555:25: warning: cast increases required alignment of target type [-Wcast-align]
regcomp.c: In function ‘Perl_reg_named_buff_scalar’:
regcomp.c: In function ‘Perl_reg_named_buff_all’:
regcomp.c:7617:25: warning: cast increases required alignment of target type [-Wcast-align]
regcomp.c: In function ‘S__invlist_array_init’:
regcomp.c:8016:21: warning: cast increases required alignment of target type [-Wcast-align]
regcomp.c: In function ‘S_reg’:
regcomp.c:7917:9: warning: declaration of ‘num’ shadows a previous local [-Wshadow]
regcomp.c:9778:9: warning: shadowed declaration is here [-Wshadow]
regcomp.c:9940:11: warning: declaration of ‘num’ shadows a previous local [-Wshadow]
regcomp.c:10024:39: warning: cast increases required alignment of target type [-Wcast-align]
regcomp.c:10033:38: warning: cast increases required alignment of target type [-Wcast-align]
regcomp.c:10108:29: warning: cast increases required alignment of target type [-Wcast-align]
regcomp.c:10302:18: warning: declaration of ‘num’ shadows a previous local [-Wshadow]
regcomp.c:10344:34: warning: cast increases required alignment of target type [-Wcast-align]
regcomp.c: In function ‘S_grok_bslash_N’:
regcomp.c:540:8: warning: declaration of ‘len’ shadows a previous local [-Wshadow]
regcomp.c:11259:9: warning: shadowed declaration is here [-Wshadow]
regcomp.c: In function ‘S_regatom’:
regcomp.c:12004:9: warning: declaration of ‘parse_start’ shadows a previous local [-Wshadow]
regcomp.c:11656:11: warning: shadowed declaration is here [-Wshadow]
regcomp.c:12184:20: warning: declaration of ‘parse_start’ shadows a previous local [-Wshadow]
regcomp.c:12246:13: warning: shadowed declaration is here [-Wshadow]
regcomp.c:12517:12: warning: declaration of ‘flags’ shadows a previous local [-Wshadow]
regcomp.c:11655:9: warning: shadowed declaration is here [-Wshadow]
regcomp.c:12555:12: warning: declaration of ‘len’ shadows a previous local [-Wshadow]
regcomp.c: In function ‘S_populate_ANYOF_from_invlist’:
regcomp.h:570:38: warning: cast increases required alignment of target type [-Wcast-align]
regcomp.h:571:28: warning: cast increases required alignment of target type [-Wcast-align]
regcomp.c: In function ‘S_handle_regex_sets’:
regcomp.c:13343:12: warning: declaration of ‘depth’ shadows a parameter [-Wshadow]
regcomp.c:13300:37: warning: shadowed declaration is here [-Wshadow]
regcomp.c:13318:12: warning: shadowed declaration is here [-Wshadow]
regcomp.c:13560:34: warning: declaration of ‘save_parse’ shadows a previous local [-Wshadow]
regcomp.c:13322:22: warning: shadowed declaration is here [-Wshadow]
regcomp.c:13752:25: warning: declaration of ‘lhs’ shadows a previous local [-Wshadow]
regcomp.c:13538:17: warning: shadowed declaration is here [-Wshadow]
regcomp.c: In function ‘S_regclass’:
regcomp.h:540:46: warning: cast increases required alignment of target type [-Wcast-align]
regcomp.h:537:35: warning: cast increases required alignment of target type [-Wcast-align]
regcomp.h:531:34: warning: cast increases required alignment of target type [-Wcast-align]
regcomp.c: In function ‘S_set_ANYOF_arg’:
regcomp.c: In function ‘Perl__get_regclass_nonbitmap_data’:
regcomp.c: In function ‘S_reganode’:
regcomp.c: In function ‘S_reg2Lanode’:
regcomp.c: In function ‘S_regtail’:
regcomp.c: In function ‘S_regtail_study’:
regcomp.c: In function ‘Perl_regprop’:
regcomp.c:16963:27: warning: cast increases required alignment of target type [-Wcast-align]
regcomp.h:549:8: warning: cast increases required alignment of target type [-Wcast-align]
regcomp.c: In function ‘Perl_regfree_internal’:
regcomp.c: In function ‘Perl_regnext’:
regcomp.c: In function ‘Perl_save_re_context’:
regcomp.c:17781:22: warning: shadowed declaration is here [-Wshadow]
regcomp.c: In function ‘S_dumpuntil’:
regcomp.c:18168:17: warning: declaration of ‘op’ shadows a previous local [-Wshadow]
regcomp.c:18100:8: warning: shadowed declaration is here [-Wshadow]
inline.h:159:1: warning: inlining failed in call to ‘S_SvREFCNT_dec’: call is unlikely and code size would grow [-Winline]
sv.h:343:26: warning: called from here [-Winline]
dump.c: In function ‘Perl_sv_peek’:
dump.c:387:13: warning: comparing floating point with == or != is unsafe [-Wfloat-equal]
dump.c:398:13: warning: comparing floating point with == or != is unsafe [-Wfloat-equal]
dump.c: In function ‘Perl_do_magic_dump’:
dump.c:1233:35: warning: cast increases required alignment of target type [-Wcast-align]
dump.c: In function ‘Perl_do_sv_dump’:
dump.c:2246:1: warning: no previous prototype for ‘S_deb_padvar’ [-Wmissing-prototypes]
op.c: In function ‘Perl_report_redefined_cv’:
gv.h:46:18: warning: called from here [-Winline]
regcomp.c: In function ‘Perl__invlist_intersection_maybe_complement_2nd’:
regcomp.c:9091:1: warning: inlining failed in call to ‘S_invlist_clone’: --param max-inline-insns-single limit reached [-Winline]
embed.h:977:26: warning: called from here [-Winline]
regcomp.c: In function ‘S_ssc_finalize’:
regcomp.c: In function ‘Perl__invlist_union_maybe_complement_2nd’:
embed.h:579:24: warning: called from here [-Winline]
util.c: In function ‘Perl_safesysmalloc’:
perl.h:165:22: warning: declaration of ‘my_perl’ shadows a previous local [-Wshadow]
perl.h:165:22: warning: shadowed declaration is here [-Wshadow]
util.c: In function ‘Perl_safesysrealloc’:
util.c: In function ‘Perl_safesysfree’:
util.c: In function ‘Perl_safesyscalloc’:
util.c: In function ‘Perl_fbm_compile’:
util.c:658:16: warning: declaration of ‘mg’ shadows a previous local [-Wshadow]
util.c:646:12: warning: shadowed declaration is here [-Wshadow]
util.c: In function ‘S_invoke_exception_hook’:
util.c: In function ‘Perl_my_setenv’:
util.c:2080:27: warning: declaration of ‘len’ shadows a previous local [-Wshadow]
util.c:2061:19: warning: shadowed declaration is here [-Wshadow]
util.c: In function ‘Perl_my_popen_list’:
util.c:2430:11: warning: declaration of ‘n’ shadows a parameter [-Wshadow]
util.c:2330:48: warning: shadowed declaration is here [-Wshadow]
vutil.c: In function ‘Perl_new_version’:
vutil.c: In function ‘Perl_upg_version’:
vutil.c:567:9: warning: shadowed declaration is here [-Wshadow]
vutil.c:588:9: warning: shadowed declaration is here [-Wshadow]
vutil.c: In function ‘Perl_vnumify’:
vutil.c: In function ‘Perl_vnormal’:
vutil.c: In function ‘Perl_vcmp’:
regcomp.c:9126:1: warning: inlining failed in call to ‘S_invlist_iterinit’: call is unlikely and code size would grow [-Winline]
embed.h:981:26: warning: called from here [-Winline]
regcomp.c:9134:1: warning: inlining failed in call to ‘S_invlist_iterfinish’: call is unlikely and code size would grow [-Winline]
embed.h:980:28: warning: called from here [-Winline]
util.c: In function ‘Perl_get_re_arg’:
mg.c: In function ‘S_save_magic_flags’:
scope.h:327:34: warning: cast increases required alignment of target type [-Wcast-align]
mg.c: In function ‘Perl_mg_get’:
mg.c: In function ‘Perl_mg_set’:
mg.c: In function ‘S_mg_free_struct’:
mg.c: In function ‘Perl_magic_getuvar’:
mg.c:1170:32: warning: cast increases required alignment of target type [-Wcast-align]
mg.c: In function ‘restore_sigmask’:
mg.c:1328:37: warning: cast increases required alignment of target type [-Wcast-align]
mg.c: In function ‘Perl_magic_methcall’:
mg.c:1824:16: warning: declaration of ‘sv’ shadows a parameter [-Wshadow]
mg.c:1792:31: warning: shadowed declaration is here [-Wshadow]
mg.c: In function ‘Perl_magic_setdbline’:
mg.c: In function ‘Perl_magic_setuvar’:
mg.c:2447:38: warning: cast increases required alignment of target type [-Wcast-align]
mg.c: In function ‘Perl_magic_setlvref’:
mg.c:2546:34: warning: cast increases required alignment of target type [-Wcast-align]
mg.c:2550:39: warning: cast increases required alignment of target type [-Wcast-align]
mg.c: In function ‘Perl_magic_set’:
mg.c:2602:12: warning: declaration of ‘s’ shadows a previous local [-Wshadow]
mg.c:2570:17: warning: shadowed declaration is here [-Wshadow]
mg.c:2709:13: warning: declaration of ‘len’ shadows a previous local [-Wshadow]
mg.c:2574:12: warning: shadowed declaration is here [-Wshadow]
mg.c:2764:14: warning: declaration of ‘len’ shadows a previous local [-Wshadow]
mg.c:2764:19: warning: declaration of ‘i’ shadows a previous local [-Wshadow]
mg.c:2573:9: warning: shadowed declaration is here [-Wshadow]
mg.c:2779:34: warning: cast increases required alignment of target type [-Wcast-align]
mg.c:2789:11: warning: declaration of ‘len’ shadows a previous local [-Wshadow]
mg.c:2764:14: warning: shadowed declaration is here [-Wshadow]
mg.c: In function ‘Perl_sighandler’:
mg.c: In function ‘S_restore_magic’:
inline_invlist.c:48:1: warning: inlining failed in call to ‘S__invlist_contains_cp’: call is unlikely and code size would grow [-Winline]
embed.h:1033:30: warning: called from here [-Winline]
inline_invlist.c:60:1: warning: inlining failed in call to ‘S_invlist_array’: call is unlikely and code size would grow [-Winline]
embed.h:1039:24: warning: called from here [-Winline]
regcomp.c:11385:1: warning: inlining failed in call to ‘S_compute_EXACTish’: call is unlikely and code size would grow [-Winline]
regcomp.c:15429:20: warning: called from here [-Winline]
regcomp.c:11407:1: warning: inlining failed in call to ‘S_alloc_maybe_populate_EXACT’: call is unlikely and code size would grow [-Winline]
embed.h:968:49: warning: called from here [-Winline]
regcomp.c:15933:28: warning: called from here [-Winline]
util.c: In function ‘Perl_get_db_sub’:
util.c:5633:1: warning: inlining failed in call to ‘S_gv_has_usable_name’: --param max-inline-insns-single limit reached [-Winline]
util.c:5668:24: warning: called from here [-Winline]
util.c:5673:10: warning: called from here [-Winline]
mro_core.c: In function ‘S_mro_get_linear_isa_dfs’:
mro_core.c:334:12: warning: declaration of ‘svp’ shadows a previous local [-Wshadow]
mro_core.c:274:14: warning: shadowed declaration is here [-Wshadow]
sv.h:1807:3: warning: cast increases required alignment of target type [-Wcast-align]
mro_core.c: In function ‘Perl_mro_isa_changed_in’:
mro_core.c:599:39: warning: cast increases required alignment of target type [-Wcast-align]
mro_core.c:600:28: warning: declaration of ‘isa’ shadows a previous local [-Wshadow]
mro_core.c:497:9: warning: shadowed declaration is here [-Wshadow]
mro_core.c: In function ‘Perl_mro_package_moved’:
mro_core.c:860:13: warning: declaration of ‘stash’ shadows a parameter [-Wshadow]
mro_core.c:739:41: warning: shadowed declaration is here [-Wshadow]
mro_core.c:860:22: warning: cast increases required alignment of target type [-Wcast-align]
mro_core.c: In function ‘S_mro_gather_and_rename’:
mro_core.c:918:13: warning: declaration of ‘entry’ shadows a previous local [-Wshadow]
mro_core.c:887:9: warning: shadowed declaration is here [-Wshadow]
regcomp.c: In function ‘S_regpiece’:
hv.c: In function ‘S_save_hek_flags’:
hv.c:85:11: warning: cast increases required alignment of target type [-Wcast-align]
hv.c: In function ‘Perl_hek_dup’:
hv.c: In function ‘Perl_he_dup’:
hv.c:161:19: warning: cast increases required alignment of target type [-Wcast-align]
hv.c:168:7: warning: declaration of ‘shared’ shadows a parameter [-Wshadow]
hv.c:140:37: warning: shadowed declaration is here [-Wshadow]
hv.c: In function ‘Perl_hv_common’:
hv.c:360:33: warning: cast increases required alignment of target type [-Wcast-align]
hv.c:425:26: warning: cast increases required alignment of target type [-Wcast-align]
hv.c:582:20: warning: cast increases required alignment of target type [-Wcast-align]
hv.c:806:16: warning: cast increases required alignment of target type [-Wcast-align]
hv.c: In function ‘S_hv_delete_common’:
hv.c:1009:10: warning: declaration of ‘sv’ shadows a previous local [-Wshadow]
hv.c:999:9: warning: shadowed declaration is here [-Wshadow]
hv.c: In function ‘S_hsplit’:
hv.c:1272:19: warning: cast increases required alignment of target type [-Wcast-align]
hv.c:1279:15: warning: cast increases required alignment of target type [-Wcast-align]
hv.c:1312:11: warning: cast increases required alignment of target type [-Wcast-align]
hv.c: In function ‘Perl_hv_ksplit’:
hv.c:1384:23: warning: cast increases required alignment of target type [-Wcast-align]
hv.c: In function ‘Perl_newHVhv’:
hv.c:1421:9: warning: cast increases required alignment of target type [-Wcast-align]
hv.c: In function ‘Perl_hv_copy_hints_hv’:
hv.c: In function ‘S_hv_free_ent_ret’:
hv.c: In function ‘Perl_hv_delayfree_ent’:
hv.c: In function ‘Perl_hv_clear’:
hv.c: In function ‘Perl_hfree_next_entry’:
hv.c: In function ‘Perl_hv_undef_flags’:
hv.c: In function ‘S_hv_auxinit’:
hv.c:2058:23: warning: cast increases required alignment of target type [-Wcast-align]
hv.c: In function ‘Perl_hv_name_set’:
hv.c:2210:16: warning: declaration of ‘name’ shadows a parameter [-Wshadow]
hv.c:2193:44: warning: shadowed declaration is here [-Wshadow]
hv.c: In function ‘Perl_hv_iternext_flags’:
hv.c:2527:23: warning: cast increases required alignment of target type [-Wcast-align]
hv.c: In function ‘Perl_hv_iterkey’:
hv.c: In function ‘Perl_hv_iterval’:
hv.c: In function ‘S_unshare_hek_or_pvn’:
hv.c:2776:7: warning: cast increases required alignment of target type [-Wcast-align]
hv.c: In function ‘S_share_hek_flags’:
hv.c:2936:14: warning: cast increases required alignment of target type [-Wcast-align]
hv.c: In function ‘Perl_refcounted_he_chain_2hv’:
hv.c:3084:16: warning: cast increases required alignment of target type [-Wcast-align]
hv.c: In function ‘Perl_refcounted_he_fetch_pvn’:
hv.c:3206:18: warning: declaration of ‘p’ shadows a previous local [-Wshadow]
hv.c:3193:40: warning: shadowed declaration is here [-Wshadow]
hv.c:3206:30: warning: declaration of ‘keyend’ shadows a previous local [-Wshadow]
hv.c:3193:14: warning: shadowed declaration is here [-Wshadow]
hv.c: In function ‘Perl_refcounted_he_fetch_sv’:
hv.c: In function ‘Perl_refcounted_he_new_pvn’:
hv.c:3382:18: warning: declaration of ‘p’ shadows a previous local [-Wshadow]
hv.c:3369:40: warning: shadowed declaration is here [-Wshadow]
hv.c:3382:30: warning: declaration of ‘keyend’ shadows a previous local [-Wshadow]
hv.c:3369:14: warning: shadowed declaration is here [-Wshadow]
hv.c: In function ‘Perl_refcounted_he_new_sv’:
hv.c: In function ‘Perl_hv_assert’:
av.c: In function ‘S_adjust_index’:
av.c: In function ‘Perl_av_clear’:
av.c: In function ‘Perl_av_undef’:
av.c: In function ‘Perl_av_unshift’:
av.c:699:16: warning: declaration of ‘i’ shadows a previous local [-Wshadow]
av.c:668:13: warning: shadowed declaration is here [-Wshadow]
av.c: In function ‘Perl_av_exists’:
pp_hot.c: In function ‘Perl_pp_and’:
pp_hot.c: In function ‘Perl_pp_sassign’:
pp_hot.c: In function ‘Perl_pp_cond_expr’:
pp_hot.c: In function ‘Perl_pp_readline’:
pp_hot.c: In function ‘Perl_pp_or’:
pp_hot.c: In function ‘Perl_pp_print’:
gv.h:31:19: warning: declaration of ‘_gvgp’ shadows a previous local [-Wshadow]
gv.h:31:19: warning: shadowed declaration is here [-Wshadow]
pp_hot.c: In function ‘Perl_pp_aassign’:
pp_hot.c: In function ‘Perl_pp_match’:
pp_hot.c:1533:13: warning: declaration of ‘len’ shadows a previous local [-Wshadow]
pp_hot.c:1390:12: warning: shadowed declaration is here [-Wshadow]
pp_hot.c:1534:22: warning: declaration of ‘s’ shadows a previous local [-Wshadow]
pp_hot.c:1381:17: warning: shadowed declaration is here [-Wshadow]
pp_hot.c: In function ‘Perl_pp_helem’:
pp_hot.c:1864:1: warning: no previous prototype for ‘S_softref2xv_lite’ [-Wmissing-prototypes]
pp_hot.c: In function ‘Perl_pp_multideref’:
pp_hot.c: In function ‘Perl_pp_grepwhile’:
pp_hot.c: In function ‘Perl_pp_entersub’:
pp_hot.c:3237:11: warning: declaration of ‘sv’ shadows a previous local [-Wshadow]
pp.h:339:21: warning: shadowed declaration is here [-Wshadow]
pp_hot.c: In function ‘Perl_pp_aelem’:
pp_hot.c: In function ‘Perl_vivify_ref’:
pp_hot.c: In function ‘S_opmethod_stash’:
sv.c: In function ‘Perl_more_bodies’:
perl.h:165:22: warning: declaration of ‘my_perl’ shadows a parameter [-Wshadow]
sv.c:1178:7: warning: cast increases required alignment of target type [-Wcast-align]
sv.c:1182:3: warning: cast increases required alignment of target type [-Wcast-align]
sv.c: In function ‘Perl_sv_upgrade’:
sv.c:435:14: warning: cast increases required alignment of target type [-Wcast-align]
sv.h:1309:19: warning: cast increases required alignment of target type [-Wcast-align]
sv.c: In function ‘S_sv_2iuv_common’:
sv.c:2174:20: warning: comparing floating point with == or != is unsafe [-Wfloat-equal]
sv.c:2218:14: warning: comparing floating point with == or != is unsafe [-Wfloat-equal]
sv.c:2336:37: warning: comparing floating point with == or != is unsafe [-Wfloat-equal]
sv.c:2351:41: warning: comparing floating point with == or != is unsafe [-Wfloat-equal]
sv.c: In function ‘Perl_sv_2pv_flags’:
sv.c:3123:16: warning: comparing floating point with == or != is unsafe [-Wfloat-equal]
sv.c: In function ‘Perl_sv_2bool_flags’:
sv.c:3381:52: warning: comparing floating point with == or != is unsafe [-Wfloat-equal]
sv.c: In function ‘S_glob_assign_glob’:
gv.h:36:13: warning: shadowed declaration is here [-Wshadow]
sv.c:4012:17: warning: cast increases required alignment of target type [-Wcast-align]
regcomp.c: In function ‘S_study_chunk.constprop’:
regcomp.c:1503:1: warning: inlining failed in call to ‘S_ssc_add_range’: call is unlikely and code size would grow [-Winline]
embed.h:1010:30: warning: called from here [-Winline]
sv.c: In function ‘Perl_sv_setsv_flags’:
sv.c:4546:23: warning: cast increases required alignment of target type [-Wcast-align]
sv.c: In function ‘Perl_sv_setsv_cow’:
sv.c: In function ‘Perl_sv_sethek’:
sv.c:5010:16: warning: cast increases required alignment of target type [-Wcast-align]
sv.c: In function ‘S_sv_uncow’:
sv.c: In function ‘Perl_sv_magicext’:
sv.c:5732:49: warning: cast increases required alignment of target type [-Wcast-align]
sv.c: In function ‘S_sv_unmagicext_flags’:
sv.c: In function ‘Perl_sv_replace’:
pp.c: In function ‘Perl_pp_padav’:
sv.c: In function ‘S_anonymise_cv_maybe’:
pp.c: In function ‘Perl_pp_av2arylen’:
pp.c: In function ‘Perl_pp_rv2cv’:
sv.c: In function ‘Perl_sv_clear’:
pp.c: In function ‘Perl_pp_anoncode’:
sv.c:1060:29: warning: cast increases required alignment of target type [-Wcast-align]
sv.c: In function ‘S_curse’:
sv.c: In function ‘Perl_sv_len_utf8_nomg’:
sv.c:7160:23: warning: cast increases required alignment of target type [-Wcast-align]
sv.c: In function ‘S_sv_pos_u2b_cached’:
sv.c:7270:22: warning: cast increases required alignment of target type [-Wcast-align]
sv.c: In function ‘S_utf8_mg_pos_cache_update’:
sv.c:7514:19: warning: cast increases required alignment of target type [-Wcast-align]
sv.c: In function ‘Perl_sv_pos_b2u_flags’:
sv.c:7681:29: warning: cast increases required alignment of target type [-Wcast-align]
sv.c: In function ‘Perl_sv_collxfrm_flags’:
sv.c:8084:32: warning: cast increases required alignment of target type [-Wcast-align]
sv.c: In function ‘Perl_sv_gets’:
perl.h:1735:26: warning: cast from function call of type ‘char *’ to non-matching type ‘long unsigned int’ [-Wbad-function-cast]
sv.c: In function ‘Perl_sv_inc_nomg’:
sv.c:8787:34: warning: comparing floating point with == or != is unsafe [-Wfloat-equal]
sv.c: In function ‘Perl_sv_dec_nomg’:
sv.c:8966:38: warning: comparing floating point with == or != is unsafe [-Wfloat-equal]
pp.c: In function ‘Perl_pp_divide’:
pp.c:1522:12: warning: comparing floating point with == or != is unsafe [-Wfloat-equal]
pp.c: In function ‘Perl_pp_modulo’:
pp.c:1622:10: warning: comparing floating point with == or != is unsafe [-Wfloat-equal]
pp.c:1626:34: warning: comparing floating point with == or != is unsafe [-Wfloat-equal]
sv.c: In function ‘Perl_newSVhek’:
sv.c:9224:18: warning: cast increases required alignment of target type [-Wcast-align]
pp.c: In function ‘Perl_pp_repeat’:
pp.h:338:21: warning: declaration of ‘sv’ shadows a previous local [-Wshadow]
pp.c:1661:9: warning: shadowed declaration is here [-Wshadow]
sv.c: In function ‘Perl_newSViv’:
sv.c: In function ‘Perl_newSVuv’:
sv.c: In function ‘Perl_newRV_noinc’:
sv.c: In function ‘Perl_sv_resetpvn’:
sv.c:9611:19: warning: cast increases required alignment of target type [-Wcast-align]
pp.c: In function ‘Perl_do_ncmp’:
pp.c:2102:15: warning: comparing floating point with == or != is unsafe [-Wfloat-equal]
sv.c: In function ‘Perl_sv_true’:
sv.c:9839:20: warning: comparing floating point with == or != is unsafe [-Wfloat-equal]
pp.c: In function ‘Perl_pp_not’:
sv.c: In function ‘Perl_newSVrv’:
pp.c: In function ‘S_scomplement’:
pp.c:2496:13: warning: cast increases required alignment of target type [-Wcast-align]
sv.c: In function ‘Perl_sv_bless’:
pp.c: In function ‘Perl_pp_rand’:
pp.c:2906:12: warning: comparing floating point with == or != is unsafe [-Wfloat-equal]
sv.c: In function ‘S_F0convert’:
sv.c:10814:19: warning: comparing floating point with == or != is unsafe [-Wfloat-equal]
sv.c: In function ‘S_hextract’:
sv.c:10968:32: warning: comparing floating point with == or != is unsafe [-Wfloat-equal]
sv.c: In function ‘Perl_sv_vcatpvfn_flags’:
sv.c:11445:11: warning: declaration of ‘sv’ shadows a parameter [-Wshadow]
sv.c:11203:40: warning: shadowed declaration is here [-Wshadow]
sv.c:11745:13: warning: declaration of ‘i’ shadows a previous local [-Wshadow]
sv.c:11348:6: warning: shadowed declaration is here [-Wshadow]
sv.c:11806:11: warning: declaration of ‘p’ shadows a previous local [-Wshadow]
sv.c:11207:11: warning: shadowed declaration is here [-Wshadow]
sv.c:12302:23: warning: declaration of ‘p’ shadows a previous local [-Wshadow]
sv.c:12373:28: warning: comparing floating point with == or != is unsafe [-Wfloat-equal]
sv.c:12537:19: warning: declaration of ‘p’ shadows a previous local [-Wshadow]
sv.c:12693:14: warning: declaration of ‘nsv’ shadows a previous local [-Wshadow]
sv.c:11216:9: warning: shadowed declaration is here [-Wshadow]
sv.c:12718:10: warning: declaration of ‘i’ shadows a previous local [-Wshadow]
sv.c:12727:10: warning: declaration of ‘i’ shadows a previous local [-Wshadow]
sv.c:12732:10: warning: declaration of ‘i’ shadows a previous local [-Wshadow]
sv.c: In function ‘Perl_mg_dup’:
sv.c:13142:15: warning: cast increases required alignment of target type [-Wcast-align]
sv.c:13144:27: warning: cast increases required alignment of target type [-Wcast-align]
sv.c:13150:35: warning: cast increases required alignment of target type [-Wcast-align]
sv.c: In function ‘Perl_rvpv_dup’:
sv.c: In function ‘S_sv_dup_common’:
pp.c: In function ‘Perl_pp_aslice’:
sv.c:13699:23: warning: cast increases required alignment of target type [-Wcast-align]
pp.c: In function ‘S_do_delete_local’:
pp.c: In function ‘Perl_pp_hslice’:
sv.c: In function ‘Perl_ss_dup’:
perl.h:1757:20: warning: cast from function call of type ‘void *’ to non-matching type ‘long unsigned int’ [-Wbad-function-cast]
pp.c: In function ‘Perl_pp_reverse’:
sv.c: In function ‘Perl_sv_recode_to_utf8’:
sv.c: In function ‘Perl_sv_cat_decode’:
sv.c: In function ‘S_find_hash_subscript’:
pp.c: In function ‘Perl_pp_refassign’:
sv.c: In function ‘S_find_uninit_var’:
sv.c:16157:13: warning: declaration of ‘gv’ shadows a previous local [-Wshadow]
pp.c: In function ‘Perl_pp_lvref’:
pp.c:6425:9: warning: declaration of ‘mg’ shadows a previous local [-Wshadow]
sv.c:15585:15: warning: shadowed declaration is here [-Wshadow]
pp.c:6417:19: warning: shadowed declaration is here [-Wshadow]
pp.c: In function ‘Perl_pp_lvrefslice’:
pp_hot.c: In function ‘Perl_pp_method_named’:
pp_hot.c:3414:1: warning: inlining failed in call to ‘S_opmethod_stash’: --param max-inline-insns-single limit reached [-Winline]
pp_hot.c:3540:15: warning: called from here [-Winline]
pp_hot.c: In function ‘Perl_pp_method_super’:
embed.h:1638:27: warning: called from here [-Winline]
pp_hot.c: In function ‘Perl_pp_method_redir’:
pp_hot.c: In function ‘Perl_pp_method_redir_super’:
scope.c: In function ‘Perl_leave_scope’:
scope.c:829:17: warning: declaration of ‘sv’ shadows a previous local [-Wshadow]
scope.c:765:9: warning: shadowed declaration is here [-Wshadow]
scope.c:864:17: warning: declaration of ‘sv’ shadows a previous local [-Wshadow]
scope.c:1136:14: warning: declaration of ‘sv’ shadows a previous local [-Wshadow]
scope.c:1201:8: warning: declaration of ‘svp’ shadows a previous local [-Wshadow]
scope.c:784:14: warning: shadowed declaration is here [-Wshadow]
pp_ctl.c: In function ‘Perl_pp_formline’:
pp_ctl.c:492:11: warning: cast increases required alignment of target type [-Wcast-align]
pp_ctl.c:832:21: warning: declaration of ‘len’ shadows a previous local [-Wshadow]
pp_ctl.c:480:12: warning: shadowed declaration is here [-Wshadow]
pp_ctl.c:832:21: warning: shadowed declaration is here [-Wshadow]
pp_ctl.c: In function ‘Perl_pp_mapwhile’:
pp_ctl.c:1096:6: warning: declaration of ‘src’ shadows a previous local [-Wshadow]
pp_ctl.c:974:10: warning: shadowed declaration is here [-Wshadow]
pp_ctl.c: In function ‘Perl_pp_range’:
pp_ctl.c: In function ‘Perl_pp_flip’:
pp_ctl.c: In function ‘Perl_pp_flop’:
pp_ctl.c: In function ‘Perl_pp_xor’:
pp_ctl.c: In function ‘Perl_pp_return’:
pp_ctl.c: In function ‘Perl_pp_goto’:
pp_ctl.c:2791:20: warning: declaration of ‘cx’ shadows a previous local [-Wshadow]
pp_ctl.c:2773:19: warning: shadowed declaration is here [-Wshadow]
pp_ctl.c:2903:8: warning: declaration of ‘sv’ shadows a previous local [-Wshadow]
pp_ctl.c:2785:13: warning: shadowed declaration is here [-Wshadow]
pp_ctl.c: In function ‘S_doeval’:
pp_ctl.c: In function ‘Perl_pp_require’:
pp_ctl.c:3907:8: warning: declaration of ‘i’ shadows a previous local [-Wshadow]
pp_ctl.c:3854:10: warning: shadowed declaration is here [-Wshadow]
pp_ctl.c: In function ‘Perl_pp_hintseval’:
pp_ctl.c: In function ‘Perl_pp_entereval’:
pp_ctl.c:4229:9: warning: declaration of ‘len’ shadows a previous local [-Wshadow]
pp_ctl.c:4208:12: warning: shadowed declaration is here [-Wshadow]
pp_ctl.c:4240:9: warning: declaration of ‘len’ shadows a previous local [-Wshadow]
pp_ctl.c: In function ‘Perl_pp_leaveeval’:
pp_ctl.c: In function ‘S_matcher_matches_sv’:
pp_ctl.c: In function ‘S_do_smartmatch’:
pp_ctl.c: In function ‘Perl_pp_enterwhen’:
pp_ctl.c: In function ‘S_run_user_filter’:
time64.c: In function ‘S_gmtime64_r’:
time64.c:376:17: warning: cast from function call of type ‘double’ to non-matching type ‘int’ [-Wbad-function-cast]
time64.c:378:17: warning: cast from function call of type ‘double’ to non-matching type ‘int’ [-Wbad-function-cast]
time64.c:380:17: warning: cast from function call of type ‘double’ to non-matching type ‘int’ [-Wbad-function-cast]
time64.c:388:17: warning: cast from function call of type ‘double’ to non-matching type ‘int’ [-Wbad-function-cast]
time64.c:400:18: warning: cast from function call of type ‘double’ to non-matching type ‘int’ [-Wbad-function-cast]
time64.c:424:18: warning: cast from function call of type ‘double’ to non-matching type ‘int’ [-Wbad-function-cast]
time64.c: In function ‘S_localtime64_r’:
time64.c:509:17: warning: cast from function call of type ‘Time64_T’ to non-matching type ‘long int’ [-Wbad-function-cast]
pp_sys.c: In function ‘Perl_pp_glob’:
pp_sys.c: In function ‘Perl_tied_method’:
pp.h:69:19: warning: declaration of ‘sp’ shadows a parameter [-Wshadow]
pp_sys.c:528:43: warning: shadowed declaration is here [-Wshadow]
pp_sys.c: In function ‘Perl_pp_tie’:
pp_sys.c: In function ‘Perl_pp_sselect’:
pp_sys.c:1123:13: warning: declaration of ‘sv’ shadows a previous local [-Wshadow]
pp_sys.c:1100:9: warning: shadowed declaration is here [-Wshadow]
pp_sys.c:1227:2: warning: cast increases required alignment of target type [-Wcast-align]
pp_sys.c:1228:2: warning: cast increases required alignment of target type [-Wcast-align]
pp_sys.c:1229:2: warning: cast increases required alignment of target type [-Wcast-align]
pp_sys.c: In function ‘S_doform’:
pp_sys.c: In function ‘Perl_pp_sysread’:
pp_sys.c:1722:7: warning: cast increases required alignment of target type [-Wcast-align]
pp_sys.c: In function ‘Perl_pp_syswrite’:
pp_sys.c:1971:17: warning: cast increases required alignment of target type [-Wcast-align]
pp_sys.c: In function ‘Perl_pp_tell’:
pp.h:305:46: warning: cast from function call of type ‘off64_t’ to non-matching type ‘double’ [-Wbad-function-cast]
pp_sys.c: In function ‘Perl_pp_truncate’:
pp_sys.c: In function ‘Perl_pp_bind’:
pp_sys.c:2549:23: warning: cast increases required alignment of target type [-Wcast-align]
pp_sys.c:2550:26: warning: cast increases required alignment of target type [-Wcast-align]
pp_sys.c: In function ‘Perl_pp_accept’:
pp_sys.c:2602:55: warning: cast increases required alignment of target type [-Wcast-align]
pp_sys.c: In function ‘Perl_pp_getpeername’:
pp_sys.c:2775:31: warning: cast increases required alignment of target type [-Wcast-align]
pp_sys.c:2779:31: warning: cast increases required alignment of target type [-Wcast-align]
pp_sys.c: In function ‘Perl_pp_stat’:
pp_sys.c: In function ‘S_try_amagic_ftest’:
pp_sys.c: In function ‘Perl_pp_ftis’:
pp_sys.c: In function ‘Perl_pp_system’:
pp_sys.c:4353:14: warning: cast from function call of type ‘_Bool’ to non-matching type ‘long int’ [-Wbad-function-cast]
pp_sys.c:4356:14: warning: cast from function call of type ‘_Bool’ to non-matching type ‘long int’ [-Wbad-function-cast]
pp_sys.c:4358:14: warning: cast from function call of type ‘_Bool’ to non-matching type ‘long int’ [-Wbad-function-cast]
pp_sys.c: In function ‘Perl_pp_exec’:
pp_sys.c:4412:10: warning: cast from function call of type ‘_Bool’ to non-matching type ‘long int’ [-Wbad-function-cast]
pp_sys.c:4418:10: warning: cast from function call of type ‘_Bool’ to non-matching type ‘long int’ [-Wbad-function-cast]
pp_sys.c:4424:10: warning: cast from function call of type ‘_Bool’ to non-matching type ‘long int’ [-Wbad-function-cast]
pp_sys.c: In function ‘Perl_pp_gmtime’:
pp_sys.c:4613:32: warning: comparing floating point with == or != is unsafe [-Wfloat-equal]
doop.c: In function ‘S_do_trans_simple’:
doop.c:37:31: warning: cast increases required alignment of target type [-Wcast-align]
doop.c: In function ‘S_do_trans_count’:
doop.c:105:31: warning: cast increases required alignment of target type [-Wcast-align]
doop.c: In function ‘S_do_trans_complex’:
doop.c:142:31: warning: cast increases required alignment of target type [-Wcast-align]
doop.c:206:10: warning: declaration of ‘len’ shadows a previous local [-Wshadow]
doop.c:138:12: warning: shadowed declaration is here [-Wshadow]
doop.c:252:10: warning: declaration of ‘len’ shadows a previous local [-Wshadow]
doop.c: In function ‘S_do_trans_simple_utf8’:
doop.c: In function ‘S_do_trans_count_utf8’:
doop.c: In function ‘S_do_trans_complex_utf8’:
doop.c:552:14: warning: declaration of ‘len’ shadows a previous local [-Wshadow]
doop.c:472:12: warning: shadowed declaration is here [-Wshadow]
doop.c: In function ‘Perl_do_join’:
doop.c:699:13: warning: declaration of ‘len’ shadows a previous local [-Wshadow]
doop.c:658:12: warning: shadowed declaration is here [-Wshadow]
doop.c:710:13: warning: declaration of ‘len’ shadows a previous local [-Wshadow]
doop.c: In function ‘Perl_do_vop’:
doop.c:1148:7: warning: cast increases required alignment of target type [-Wcast-align]
doop.c:1149:7: warning: cast increases required alignment of target type [-Wcast-align]
doop.c:1150:7: warning: cast increases required alignment of target type [-Wcast-align]
doio.c: In function ‘S_openn_cleanup’:
doio.c:671:36: warning: cast increases required alignment of target type [-Wcast-align]
doio.c: In function ‘Perl_my_stat_flags’:
doio.c: In function ‘Perl_do_ipcctl’:
doio.c:2282:24: warning: cast increases required alignment of target type [-Wcast-align]
doio.c:2297:31: warning: cast increases required alignment of target type [-Wcast-align]
doio.c:2310:24: warning: cast increases required alignment of target type [-Wcast-align]
doio.c: In function ‘Perl_do_msgsnd’:
doio.c:2339:23: warning: cast increases required alignment of target type [-Wcast-align]
doio.c: In function ‘Perl_do_msgrcv’:
doio.c:2372:22: warning: cast increases required alignment of target type [-Wcast-align]
doio.c: In function ‘Perl_do_semop’:
doio.c:2411:29: warning: cast increases required alignment of target type [-Wcast-align]
regexec.c: In function ‘Perl_re_intuit_start’:
regexec.c:713:17: warning: declaration of ‘sv’ shadows a parameter [-Wshadow]
regexec.c:621:25: warning: shadowed declaration is here [-Wshadow]
regexec.c: In function ‘S_find_byclass’:
regexec.c:2442:20: warning: cast increases required alignment of target type [-Wcast-align]
regexec.c:2555:33: warning: declaration of ‘tmp’ shadows a previous local [-Wshadow]
regexec.c:1817:9: warning: shadowed declaration is here [-Wshadow]
regexec.c: In function ‘S_reg_check_named_buff_matched’:
regexec.c:3861:15: warning: cast increases required alignment of target type [-Wcast-align]
regexec.c: In function ‘S_regmatch’:
utf8.c: In function ‘Perl_is_utf8_string’:
utf8.c:343:16: warning: declaration of ‘len’ shadows a parameter [-Wshadow]
utf8.c:335:41: warning: shadowed declaration is here [-Wshadow]
utf8.c: In function ‘Perl_is_utf8_string_loclen’:
utf8.c:386:16: warning: declaration of ‘len’ shadows a parameter [-Wshadow]
utf8.c:377:48: warning: shadowed declaration is here [-Wshadow]
utf8.c:846:1: warning: no previous prototype for ‘Perl_utf8_to_uvchr_buf’ [-Wmissing-prototypes]
regexec.c:5579:37: warning: comparison between signed and unsigned integer expressions [-Wsign-compare]
regexec.c:5616:37: warning: comparison between signed and unsigned integer expressions [-Wsign-compare]
regexec.c:5642:42: warning: comparison between signed and unsigned integer expressions [-Wsign-compare]
regexec.c:5711:42: warning: comparison between signed and unsigned integer expressions [-Wsign-compare]
utf8.c: In function ‘Perl_to_utf8_case’:
regexec.c:6148:22: warning: declaration of ‘startpoint’ shadows a previous local [-Wshadow]
regexec.c:4852:11: warning: shadowed declaration is here [-Wshadow]
cop.h:1126:11: warning: declaration of ‘next’ shadows a previous local [-Wshadow]
regexec.c:4829:14: warning: shadowed declaration is here [-Wshadow]
utf8.c: In function ‘Perl__core_swash_init’:
regexec.c:6744:10: warning: declaration of ‘n’ shadows a previous local [-Wshadow]
regexec.c:4830:9: warning: shadowed declaration is here [-Wshadow]
utf8.c: In function ‘Perl_swash_fetch’:
utf8.c: In function ‘S_swatch_get’:
regexec.c:7441:7: warning: declaration of ‘n’ shadows a previous local [-Wshadow]
utf8.c:3087:6: warning: declaration of ‘s’ shadows a previous local [-Wshadow]
utf8.c:2909:31: warning: shadowed declaration is here [-Wshadow]
utf8.c:3163:16: warning: declaration of ‘send’ shadows a previous local [-Wshadow]
utf8.c:2909:35: warning: shadowed declaration is here [-Wshadow]
utf8.c: In function ‘Perl__swash_inversion_hash’:
utf8.c: In function ‘Perl__swash_to_invlist’:
regexec.c: In function ‘S_regrepeat’:
utf8.c: In function ‘Perl__get_swash_invlist’:
regexec.c: In function ‘S_reginclass’:
taint.c: In function ‘Perl_taint_env’:
taint.c:161:21: warning: declaration of ‘e’ shadows a previous local [-Wshadow]
taint.c:82:24: warning: shadowed declaration is here [-Wshadow]
taint.c:179:21: warning: declaration of ‘svp’ shadows a previous local [-Wshadow]
taint.c:80:10: warning: shadowed declaration is here [-Wshadow]
universal.c: In function ‘Perl_sv_does_sv’:
universal.c: In function ‘XS_UNIVERSAL_can’:
universal.c: In function ‘XS_utf8_downgrade’:
universal.c: In function ‘XS_Internals_SvREADONLY’:
universal.c: In function ‘XS_Internals_hv_clear_placehold’:
universal.c: In function ‘XS_PerlIO_get_layers’:
universal.c: In function ‘XS_re_regname’:
universal.c: In function ‘XS_re_regnames’:
vxs.inc: In function ‘XS_universal_version’:
perlio.c: In function ‘PerlIO_find_layer’:
perlio.c: In function ‘XS_PerlIO__Layer__find’:
perlio.c: In function ‘PerlIO_push’:
perlio.c:1165:10: warning: cast increases required alignment of target type [-Wcast-align]
perlio.c: In function ‘PerlIOBase_unread’:
perliol.h:104:29: warning: cast increases required alignment of target type [-Wcast-align]
perlio.c: In function ‘PerlIOBuf_pushed’:
perlio.c: In function ‘PerlIOBuf_flush’:
perlio.c: In function ‘PerlIOBuf_fill’:
perlio.c: In function ‘PerlIOBuf_read’:
perlio.c: In function ‘PerlIOBuf_unread’:
perlio.c: In function ‘PerlIOBuf_write’:
perlio.c: In function ‘PerlIOBuf_seek’:
perlio.c: In function ‘PerlIOBuf_tell’:
perlio.c: In function ‘PerlIOBuf_popped’:
perlio.c: In function ‘PerlIOBuf_close’:
perlio.c: In function ‘PerlIOBuf_get_ptr’:
perlio.c: In function ‘PerlIOBuf_get_cnt’:
perlio.c: In function ‘PerlIOBuf_get_base’:
perlio.c: In function ‘PerlIOBuf_bufsiz’:
perlio.c: In function ‘PerlIOBuf_set_ptrcnt’:
perlio.c: In function ‘PerlIOPending_flush’:
perlio.c: In function ‘PerlIOCrlf_unread’:
perlio.c: In function ‘PerlIOCrlf_get_cnt’:
perlio.c: In function ‘PerlIOCrlf_set_ptrcnt’:
perlio.c: In function ‘PerlIOCrlf_write’:
perlio.c: In function ‘PerlIOCrlf_flush’:
perlio.c: In function ‘PerlIO_setpos’:
perlio.c:5147:33: warning: cast increases required alignment of target type [-Wcast-align]
numeric.c: In function ‘Perl_grok_numeric_radix’:
numeric.c: In function ‘Perl_grok_infnan’:
numeric.c:690:29: warning: declaration of ‘flags’ shadows a previous local [-Wshadow]
numeric.c:576:9: warning: shadowed declaration is here [-Wshadow]
numeric.c:702:29: warning: declaration of ‘flags’ shadows a previous local [-Wshadow]
numeric.c: In function ‘S_mulexp10’:
numeric.c:1118:15: warning: comparing floating point with == or != is unsafe [-Wfloat-equal]
numeric.c:1167:16: warning: comparing floating point with == or != is unsafe [-Wfloat-equal]
numeric.c:1171:19: warning: comparing floating point with == or != is unsafe [-Wfloat-equal]
numeric.c: In function ‘Perl_my_atof’:
mathoms.c:907:1: warning: no previous prototype for ‘Perl_hv_store_ent’ [-Wmissing-prototypes]
mathoms.c:913:1: warning: no previous prototype for ‘Perl_hv_exists_ent’ [-Wmissing-prototypes]
mathoms.c:922:1: warning: no previous prototype for ‘Perl_hv_fetch_ent’ [-Wmissing-prototypes]
mathoms.c:931:1: warning: no previous prototype for ‘Perl_hv_delete_ent’ [-Wmissing-prototypes]
mathoms.c:940:1: warning: no previous prototype for ‘Perl_hv_store_flags’ [-Wmissing-prototypes]
mathoms.c:948:1: warning: no previous prototype for ‘Perl_hv_store’ [-Wmissing-prototypes]
mathoms.c:965:1: warning: no previous prototype for ‘Perl_hv_exists’ [-Wmissing-prototypes]
mathoms.c:984:1: warning: no previous prototype for ‘Perl_hv_fetch’ [-Wmissing-prototypes]
mathoms.c:1004:1: warning: no previous prototype for ‘Perl_hv_delete’ [-Wmissing-prototypes]
mathoms.c:1042:1: warning: no previous prototype for ‘Perl_sv_insert’ [-Wmissing-prototypes]
mathoms.c:1050:1: warning: no previous prototype for ‘Perl_save_freesv’ [-Wmissing-prototypes]
mathoms.c:1056:1: warning: no previous prototype for ‘Perl_save_mortalizesv’ [-Wmissing-prototypes]
mathoms.c:1064:1: warning: no previous prototype for ‘Perl_save_freeop’ [-Wmissing-prototypes]
mathoms.c:1070:1: warning: no previous prototype for ‘Perl_save_freepv’ [-Wmissing-prototypes]
mathoms.c:1076:1: warning: no previous prototype for ‘Perl_save_op’ [-Wmissing-prototypes]
mathoms.c:1083:1: warning: no previous prototype for ‘Perl_gv_SVadd’ [-Wmissing-prototypes]
mathoms.c:1090:1: warning: no previous prototype for ‘Perl_gv_AVadd’ [-Wmissing-prototypes]
mathoms.c:1096:1: warning: no previous prototype for ‘Perl_gv_HVadd’ [-Wmissing-prototypes]
mathoms.c:1102:1: warning: no previous prototype for ‘Perl_gv_IOadd’ [-Wmissing-prototypes]
mathoms.c:1219:1: warning: no previous prototype for ‘Perl_sv_copypv’ [-Wmissing-prototypes]
mathoms.c:1712:1: warning: no previous prototype for ‘Perl_is_utf8_char_buf’ [-Wmissing-prototypes]
locale.c: In function ‘Perl_new_ctype’:
locale.c:401:17: warning: format not a string literal, argument types not checked [-Wformat-nonliteral]
locale.c: In function ‘Perl__warn_problematic_locale’:
locale.c:432:30: warning: format not a string literal, argument types not checked [-Wformat-nonliteral]
locale.c: In function ‘Perl_init_i18nl10n’:
locale.c:1069:15: warning: declaration of ‘p’ shadows a previous local [-Wshadow]
locale.c:670:11: warning: shadowed declaration is here [-Wshadow]
locale.c: In function ‘Perl_mem_collxfrm’:
locale.c:1127:6: warning: cast increases required alignment of target type [-Wcast-align]
pp_pack.c: In function ‘S_utf8_to_bytes’:
pp_pack.c:311:16: warning: declaration of ‘flags’ shadows a previous local [-Wshadow]
pp_pack.c:283:15: warning: shadowed declaration is here [-Wshadow]
pp_pack.c: In function ‘S_unpack_rec’:
pp_pack.c:940:10: warning: declaration of ‘sv’ shadows a previous local [-Wshadow]
pp_pack.c:842:9: warning: shadowed declaration is here [-Wshadow]
pp_pack.c:1289:14: warning: declaration of ‘len’ shadows a previous local [-Wshadow]
pp_pack.c:860:6: warning: shadowed declaration is here [-Wshadow]
pp_pack.c: In function ‘S_pack_rec’:
pp_pack.c:2914:23: warning: declaration of ‘from’ shadows a previous local [-Wshadow]
pp_pack.c:2086:11: warning: shadowed declaration is here [-Wshadow]
pp_pack.c:2917:23: warning: declaration of ‘len’ shadows a previous local [-Wshadow]
pp_pack.c:2100:6: warning: shadowed declaration is here [-Wshadow]
pp_sort.c: In function ‘S_mergesortsv’:
pp_sort.c:83:18: warning: cast increases required alignment of target type [-Wcast-align]
pp_sort.c: In function ‘Perl_pp_sort’:
cop.h:1128:10: warning: declaration of ‘i’ shadows a previous local [-Wshadow]
pp_sort.c:1475:18: warning: shadowed declaration is here [-Wshadow]
pp_sort.c:1686:15: warning: declaration of ‘av’ shadows a previous local [-Wshadow]
pp_sort.c:1476:9: warning: shadowed declaration is here [-Wshadow]
cop.h:1154:10: warning: declaration of ‘i’ shadows a previous local [-Wshadow]
pp_sort.c: In function ‘S_sv_ncmp’:
pp_sort.c:1907:13: warning: comparing floating point with == or != is unsafe [-Wfloat-equal]
pp_sort.c:1907:27: warning: comparing floating point with == or != is unsafe [-Wfloat-equal]
pp_sort.c: In function ‘S_amagic_ncmp’:
pp_sort.c:1931:66: warning: comparing floating point with == or != is unsafe [-Wfloat-equal]
pp_sort.c: In function ‘S_amagic_i_ncmp’:
pp_sort.c: In function ‘S_amagic_cmp’:
pp_sort.c: In function ‘S_amagic_cmp_locale’:
perlmain.c:43:25: warning: shadowed declaration is here [-Wshadow]
../../perl.h:1581:40: warning: anonymous variadic macros were introduced in C99 [-Wvariadic-macros]
../../perl.h:1596:41: warning: anonymous variadic macros were introduced in C99 [-Wvariadic-macros]
../../op_reg_common.h:108:29: warning: C++ style comments are not allowed in ISO C90
../../op_reg_common.h:108:29: warning: (this will be reported only once per input file)
../../config.h:4922:32: warning: ISO C90 does not support ‘long long’ [-Wlong-long]
../../cv.h: In function ‘CvNAME_HEK’:
../../handy.h:64:26: warning: ISO C forbids braced-groups within expressions [-Wpedantic]
../../hv_func.h: In function ‘S_perl_hash_superfast’:
../../hv_func.h:272:18: warning: cast increases required alignment of target type [-Wcast-align]
../../hv_func.h: In function ‘S_perl_hash_murmur3’:
../../hv_func.h:376:16: warning: cast increases required alignment of target type [-Wcast-align]
../../perl.h:534:29: warning: ISO C forbids braced-groups within expressions [-Wpedantic]
../../hv_func.h:121:31: warning: cast increases required alignment of target type [-Wcast-align]
../../hv_func.h: In function ‘S_perl_hash_djb2’:
../../hv_func.h:470:18: warning: cast increases required alignment of target type [-Wcast-align]
../../hv_func.h: In function ‘S_perl_hash_sdbm’:
../../hv_func.h:480:18: warning: cast increases required alignment of target type [-Wcast-align]
../../hv_func.h: In function ‘S_perl_hash_one_at_a_time’:
../../hv_func.h:506:18: warning: cast increases required alignment of target type [-Wcast-align]
../../hv_func.h: In function ‘S_perl_hash_one_at_a_time_hard’:
../../hv_func.h:521:18: warning: cast increases required alignment of target type [-Wcast-align]
../../hv_func.h: In function ‘S_perl_hash_old_one_at_a_time’:
../../hv_func.h:556:18: warning: cast increases required alignment of target type [-Wcast-align]
../../inline.h: In function ‘S_av_top_index’:
../../inline.h: In function ‘S_CvGV’:
../../inline.h: In function ‘S_MgBYTEPOS’:
../../sv.h:1207:4: warning: ISO C forbids braced-groups within expressions [-Wpedantic]
../../sv.h:1228:4: warning: ISO C forbids braced-groups within expressions [-Wpedantic]
../../inline.h: In function ‘SvAMAGIC_on’:
../../inline.h: In function ‘SvAMAGIC_off’:
../../inline.h: In function ‘S_sv_or_pv_pos_u2b’:
../../inline.h: In function ‘S_sv_only_taint_gmagic’:
../../sv.h:1223:4: warning: ISO C forbids braced-groups within expressions [-Wpedantic]
dlutils.c: In function ‘dl_generic_private_init’:
../../sv.h:1189:4: warning: ISO C forbids braced-groups within expressions [-Wpedantic]
../../perl.h:6284:12: warning: declaration of ‘my_cxtp’ shadows a previous local [-Wshadow]
../../perl.h:6273:12: warning: shadowed declaration is here [-Wshadow]
dlutils.c: In function ‘SaveError’:
../../sv.h:1180:4: warning: ISO C forbids braced-groups within expressions [-Wpedantic]
../../sv.h:1172:4: warning: ISO C forbids braced-groups within expressions [-Wpedantic]
../../perl.h:6284:12: warning: shadowed declaration is here [-Wshadow]
DynaLoader.c: In function ‘XS_DynaLoader_dl_load_file’:
DynaLoader.c: In function ‘XS_DynaLoader_dl_unload_file’:
DynaLoader.c: In function ‘XS_DynaLoader_dl_find_symbol’:
DynaLoader.c: In function ‘XS_DynaLoader_dl_undef_symbols’:
DynaLoader.c: In function ‘XS_DynaLoader_dl_install_xsub’:
DynaLoader.c: In function ‘XS_DynaLoader_dl_error’:
DynaLoader.xs: In function ‘XS_DynaLoader_CLONE’:
../../perl.h:6290:22: warning: cast increases required alignment of target type [-Wcast-align]
attributes.xs: In function ‘modify_SV_attributes’:
../../handy.h:64:35: warning: declaration of ‘_p’ shadows a previous local [-Wshadow]
../../handy.h:64:35: warning: shadowed declaration is here [-Wshadow]
attributes.xs: In function ‘XS_attributes__modify_attrs’:
ptable.h:76:16: warning: function declaration isn’t a prototype [-Wstrict-prototypes]
attributes.xs: In function ‘XS_attributes__fetch_attrs’:
arybase.xs: In function ‘ab_map_fetch’:
arybase.xs: In function ‘ab_map_store’:
arybase.xs: In function ‘ab_map_delete’:
arybase.xs: In function ‘ab_hint’:
attributes.xs: In function ‘XS_attributes__guess_stash’:
../../gv.h:31:7: warning: ISO C forbids braced-groups within expressions [-Wpedantic]
arybase.xs: In function ‘current_base’:
arybase.xs: In function ‘ab_op_is_dollar_bracket’:
../../gv.h:46:4: warning: ISO C forbids braced-groups within expressions [-Wpedantic]
attributes.xs: In function ‘XS_attributes_reftype’:
arybase.xs: In function ‘ab_process_assignment’:
arybase.xs:199:1: warning: no previous prototype for ‘tie’ [-Wmissing-prototypes]
arybase.xs: In function ‘tie’:
arybase.xs: In function ‘ab_pp_basearg’:
arybase.xs: In function ‘ab_pp_av2arylen’:
arybase.xs: In function ‘ab_pp_keys’:
arybase.xs: In function ‘ab_pp_each’:
arybase.xs: In function ‘ab_pp_index’:
arybase.xs: In function ‘ab_ck_base’:
../../perl.h:165:22: warning: declaration of ‘my_perl’ shadows a parameter [-Wshadow]
../../perl.h:165:22: warning: shadowed declaration is here [-Wshadow]
arybase.xs: In function ‘XS_arybase_FETCH’:
arybase.c: In function ‘XS_arybase_STORE’:
arybase.xs: In function ‘XS_arybase__mg_FETCH’:
arybase.xs: In function ‘XS_arybase__mg_STORE’:
arybase.xs: In function ‘boot_arybase’:
B.xs: In function ‘get_overlay_object’:
B.xs: In function ‘make_temp_object’:
B.xs: In function ‘make_cop_io_object’:
B.xs: In function ‘cstring’:
B.xs: In function ‘cchar’:
B.xs: In function ‘walkoptree’:
B.xs: In function ‘oplist’:
B.xs: In function ‘intrpvar_sv_common’:
B.xs:663:12: warning: cast increases required alignment of target type [-Wcast-align]
const-c.inc: In function ‘_add_symbol’:
const-c.inc: In function ‘get_missing_hash’:
B.xs: In function ‘XS_B_formfeed’:
B.c: In function ‘XS_B_amagic_generation’:
B.xs: In function ‘XS_B_comppadlist’:
B.c: In function ‘XS_B_sv_undef’:
B.c: In function ‘XS_B_main_root’:
B.c: In function ‘XS_B_sub_generation’:
B.c: In function ‘XS_B_walkoptree’:
B.xs: In function ‘XS_B_walkoptree_debug’:
../../sv.h:1201:4: warning: ISO C forbids braced-groups within expressions [-Wpedantic]
../../sv.h:1753:32: warning: comparing floating point with == or != is unsafe [-Wfloat-equal]
B.c: In function ‘XS_B_address’:
B.xs: In function ‘XS_B_svref_2object’:
B.c: In function ‘XS_B_opnumber’:
B.c: In function ‘XS_B_ppname’:
B.xs: In function ‘XS_B_hash’:
B.c: In function ‘XS_B_cast_I32’:
B.c: In function ‘XS_B_minus_c’:
B.c: In function ‘XS_B_cstring’:
B.xs: In function ‘XS_B_CLONE’:
B.c: In function ‘XS_B__OP_next’:
B.xs:1235:32: warning: cast increases required alignment of target type [-Wcast-align]
B.xs:1313:32: warning: cast increases required alignment of target type [-Wcast-align]
B.xs:1316:30: warning: cast increases required alignment of target type [-Wcast-align]
B.xs:1322:30: warning: cast increases required alignment of target type [-Wcast-align]
B.xs:1325:32: warning: cast increases required alignment of target type [-Wcast-align]
B.xs:1328:30: warning: cast increases required alignment of target type [-Wcast-align]
B.xs:1331:30: warning: cast increases required alignment of target type [-Wcast-align]
B.xs:1334:30: warning: cast increases required alignment of target type [-Wcast-align]
B.c: In function ‘XS_B__OP_oplist’:
B.c: In function ‘XS_B__UNOP_AUX_string’:
B.c:1672:8: warning: declaration of ‘cv’ shadows a parameter [-Wshadow]
../../XSUB.h:142:58: warning: shadowed declaration is here [-Wshadow]
B.c: In function ‘XS_B__UNOP_AUX_aux_list’:
B.c:1719:8: warning: declaration of ‘cv’ shadows a parameter [-Wshadow]
B.xs:1404:32: warning: declaration of ‘items’ shadows a previous local [-Wshadow]
../../XSUB.h:164:20: warning: shadowed declaration is here [-Wshadow]
B.c: In function ‘XS_B__SV_REFCNT’:
B.c: In function ‘XS_B__SV_object_2svref’:
B.c: In function ‘XS_B__IV_IV’:
B.c: In function ‘XS_B__IV_IVX’:
B.xs:1657:35: warning: cast increases required alignment of target type [-Wcast-align]
B.xs:1660:33: warning: cast increases required alignment of target type [-Wcast-align]
B.xs:1663:33: warning: cast increases required alignment of target type [-Wcast-align]
B.xs:1666:33: warning: cast increases required alignment of target type [-Wcast-align]
B.xs:1669:33: warning: cast increases required alignment of target type [-Wcast-align]
B.xs:1675:33: warning: cast increases required alignment of target type [-Wcast-align]
B.xs:1678:33: warning: cast increases required alignment of target type [-Wcast-align]
B.xs:1684:33: warning: cast increases required alignment of target type [-Wcast-align]
B.xs:1687:33: warning: cast increases required alignment of target type [-Wcast-align]
B.xs:1690:33: warning: cast increases required alignment of target type [-Wcast-align]
B.c: In function ‘XS_B__IV_packiv’:
B.c: In function ‘XS_B__NV_NV’:
B.c: In function ‘XS_B__REGEXP_REGEX’:
B.c: In function ‘XS_B__PV_RV’:
B.c: In function ‘XS_B__PV_PV’:
B.c: In function ‘XS_B__PVMG_MAGIC’:
B.c: In function ‘XS_B__MAGIC_MOREMAGIC’:
B.xs:1912:34: warning: cast increases required alignment of target type [-Wcast-align]
B.c: In function ‘XS_B__BM_PREVIOUS’:
B.c: In function ‘XS_B__BM_RARE’:
B.c: In function ‘XS_B__GV_NAME’:
../../sv.h:1109:24: warning: ISO C forbids braced-groups within expressions [-Wpedantic]
../../gv.h:52:7: warning: ISO C forbids braced-groups within expressions [-Wpedantic]
B.c: In function ‘XS_B__GV_is_empty’:
B.c: In function ‘XS_B__GV_GP’:
B.c: In function ‘XS_B__GV_SV’:
B.xs:2023:22: warning: declaration of ‘gv’ shadows a previous local [-Wshadow]
B.c:2610:8: warning: shadowed declaration is here [-Wshadow]
../../gv.h:58:26: warning: ISO C forbids braced-groups within expressions [-Wpedantic]
B.xs:2029:35: warning: cast increases required alignment of target type [-Wcast-align]
B.xs:2032:33: warning: cast increases required alignment of target type [-Wcast-align]
B.c: In function ‘XS_B__GV_LINE’:
B.c: In function ‘XS_B__GV_GPFLAGS’:
B.c: In function ‘XS_B__GV_FILEGV’:
B.c: In function ‘XS_B__IO_IsSTD’:
B.c: In function ‘XS_B__AV_FILL’:
B.c: In function ‘XS_B__AV_ARRAY’:
B.c: In function ‘XS_B__AV_ARRAYelt’:
B.c: In function ‘XS_B__FM_LINES’:
B.c: In function ‘XS_B__CV_CONST’:
B.c:2897:8: warning: declaration of ‘cv’ shadows a parameter [-Wshadow]
B.c: In function ‘XS_B__CV_START’:
B.c:2926:8: warning: declaration of ‘cv’ shadows a parameter [-Wshadow]
B.c: In function ‘XS_B__CV_DEPTH’:
B.c:2952:8: warning: declaration of ‘cv’ shadows a parameter [-Wshadow]
B.c: In function ‘XS_B__CV_PADLIST’:
B.c:2981:8: warning: declaration of ‘cv’ shadows a parameter [-Wshadow]
B.c: In function ‘XS_B__CV_HSCXT’:
B.c:3045:8: warning: declaration of ‘cv’ shadows a parameter [-Wshadow]
B.c: In function ‘XS_B__CV_XSUB’:
B.c:3073:8: warning: declaration of ‘cv’ shadows a parameter [-Wshadow]
B.c: In function ‘XS_B__CV_const_sv’:
B.c:3104:8: warning: declaration of ‘cv’ shadows a parameter [-Wshadow]
B.c: In function ‘XS_B__CV_GV’:
B.c:3129:8: warning: declaration of ‘cv’ shadows a parameter [-Wshadow]
B.c: In function ‘XS_B__CV_NAME_HEK’:
B.c:3156:8: warning: declaration of ‘cv’ shadows a parameter [-Wshadow]
B.c: In function ‘XS_B__HV_FILL’:
B.c: In function ‘XS_B__HV_RITER’:
B.c: In function ‘XS_B__HV_ARRAY’:
../../hv.h:365:25: warning: cast increases required alignment of target type [-Wcast-align]
B.c: In function ‘XS_B__HE_VAL’:
B.c: In function ‘XS_B__HE_HASH’:
B.c: In function ‘XS_B__RHE_HASH’:
B.c: In function ‘XS_B__PADLIST_MAX’:
B.c: In function ‘XS_B__PADLIST_NAMES’:
B.c: In function ‘XS_B__PADLIST_ARRAY’:
B.c: In function ‘XS_B__PADLIST_ARRAYelt’:
B.c: In function ‘XS_B__PADLIST_REFCNT’:
B.c: In function ‘XS_B__PADNAMELIST_ARRAY’:
B.c: In function ‘XS_B__PADNAMELIST_ARRAYelt’:
B.c: In function ‘XS_B__PADNAME_TYPE’:
B.xs:2395:35: warning: cast increases required alignment of target type [-Wcast-align]
B.xs:2398:33: warning: cast increases required alignment of target type [-Wcast-align]
B.c: In function ‘XS_B__PADNAME_PV’:
B.c: In function ‘XS_B__PADNAME_FLAGS’:
B.c: In function ‘boot_B’:
B.c:3996:5: warning: "XSubPPtmpAAAC" is not defined [-Wundef]
B.c:4085:5: warning: "XSubPPtmpAAAF" is not defined [-Wundef]
./const-xs.inc:386:7: warning: declaration of ‘he’ shadows a previous local [-Wshadow]
./const-xs.inc:8:9: warning: shadowed declaration is here [-Wshadow]
./const-xs.inc:411:11: warning: declaration of ‘cv’ shadows a parameter [-Wshadow]
../../XSUB.h:141:51: warning: shadowed declaration is here [-Wshadow]
B.xs:789:9: warning: declaration of ‘cv’ shadows a parameter [-Wshadow]
B.xs:790:17: warning: declaration of ‘file’ shadows a previous local [-Wshadow]
B.c:3739:17: warning: shadowed declaration is here [-Wshadow]
B.xs:836:5: warning: "XSubPPtmpAAAC" is not defined [-Wundef]
B.xs:842:5: warning: "XSubPPtmpAAAF" is not defined [-Wundef]
blocksort.c: In function ‘BZ2_blockSort’:
blocksort.c:1054:18: warning: cast increases required alignment of target type [-Wcast-align]
compress.c:22:13: warning: no previous prototype for ‘compress2’ [-Wmissing-prototypes]
compress.c:62:13: warning: no previous prototype for ‘compress’ [-Wmissing-prototypes]
compress.c:75:15: warning: no previous prototype for ‘compressBound’ [-Wmissing-prototypes]
uncompr.c:24:13: warning: no previous prototype for ‘uncompress’ [-Wmissing-prototypes]
Zlib.xs: In function ‘DispStream’:
Zlib.xs:440:5: warning: format ‘%p’ expects argument of type ‘void *’, but argument 2 has type ‘struct di_stream *’ [-Wformat=]
Zlib.xs:449:9: warning: format ‘%p’ expects argument of type ‘void *’, but argument 2 has type ‘struct z_stream *’ [-Wformat=]
Zlib.xs:450:9: warning: format ‘%p’ expects argument of type ‘void *’, but argument 2 has type ‘alloc_func’ [-Wformat=]
Zlib.xs:451:9: warning: format ‘%p’ expects argument of type ‘void *’, but argument 2 has type ‘free_func’ [-Wformat=]
Zlib.xs:453:9: warning: format ‘%p’ expects argument of type ‘void *’, but argument 2 has type ‘struct internal_state *’ [-Wformat=]
Zlib.xs:478:9: warning: format ‘%p’ expects argument of type ‘void *’, but argument 2 has type ‘struct SV *’ [-Wformat=]
Zlib.xs:500:8: warning: no previous prototype for ‘my_zcalloc’ [-Wmissing-prototypes]
Zlib.xs:507:6: warning: no previous prototype for ‘my_zcfree’ [-Wmissing-prototypes]
Zlib.xs: In function ‘deRef’:
Zlib.xs: In function ‘deRef_l’:
Zlib.c: In function ‘XS_Compress__Raw__Zlib_constant’:
Zlib.c: In function ‘XS_Compress__Raw__Zlib_zlib_version’:
Zlib.c: In function ‘XS_Compress__Raw__Zlib_ZLIB_VERNUM’:
Zlib.c: In function ‘XS_Compress__Raw__Zlib_zlibCompileFlags’:
Zlib.xs: In function ‘XS_Compress__Raw__Zlib_adler32’:
../../sv.h:1195:4: warning: ISO C forbids braced-groups within expressions [-Wpedantic]
Zlib.c: In function ‘XS_Compress__Raw__Zlib_crc32’:
Zlib.c: In function ‘XS_Compress__Raw__Zlib_crc32_combine’:
Zlib.c: In function ‘XS_Compress__Raw__Zlib_adler32_combine’:
Zlib.c: In function ‘XS_Compress__Raw__Zlib__deflateInit’:
Zlib.xs:790:2: warning: format ‘%p’ expects argument of type ‘void *’, but argument 8 has type ‘struct SV *’ [-Wformat=]
Zlib.xs:803:13: warning: format ‘%p’ expects argument of type ‘void *’, but argument 3 has type ‘deflateStream’ [-Wformat=]
Zlib.c: In function ‘XS_Compress__Raw__Zlib__inflateInit’:
Zlib.c: In function ‘XS_Compress__Raw__Zlib__deflateStream_DispStream’:
Zlib.c: In function ‘XS_Compress__Raw__Zlib__deflateStream_deflateReset’:
Zlib.c: In function ‘XS_Compress__Raw__Zlib__deflateStream_deflate’:
Zlib.c: In function ‘XS_Compress__Raw__Zlib__deflateStream_DESTROY’:
Zlib.xs:1058:9: warning: format ‘%p’ expects argument of type ‘void *’, but argument 2 has type ‘Compress__Raw__Zlib__deflateStream’ [-Wformat=]
Zlib.c: In function ‘XS_Compress__Raw__Zlib__deflateStream_flush’:
Zlib.c: In function ‘XS_Compress__Raw__Zlib__deflateStream__deflateParams’:
Zlib.c: In function ‘XS_Compress__Raw__Zlib__deflateStream_get_Level’:
Zlib.c: In function ‘XS_Compress__Raw__Zlib__deflateStream_get_Strategy’:
Zlib.c: In function ‘XS_Compress__Raw__Zlib__deflateStream_get_Bufsize’:
Zlib.c: In function ‘XS_Compress__Raw__Zlib__deflateStream_status’:
Zlib.c: In function ‘XS_Compress__Raw__Zlib__deflateStream_crc32’:
Zlib.c: In function ‘XS_Compress__Raw__Zlib__deflateStream_dict_adler’:
Zlib.c: In function ‘XS_Compress__Raw__Zlib__deflateStream_adler32’:
Zlib.c: In function ‘XS_Compress__Raw__Zlib__deflateStream_compressedBytes’:
Zlib.c: In function ‘XS_Compress__Raw__Zlib__deflateStream_uncompressedBytes’:
Zlib.c: In function ‘XS_Compress__Raw__Zlib__deflateStream_total_in’:
Zlib.c: In function ‘XS_Compress__Raw__Zlib__deflateStream_total_out’:
Zlib.c: In function ‘XS_Compress__Raw__Zlib__deflateStream_msg’:
Zlib.c: In function ‘XS_Compress__Raw__Zlib__deflateStream_deflateTune’:
Zlib.c: In function ‘XS_Compress__Raw__Zlib__inflateStream_DispStream’:
Zlib.c: In function ‘XS_Compress__Raw__Zlib__inflateStream_inflateReset’:
Zlib.c: In function ‘XS_Compress__Raw__Zlib__inflateStream_inflate’:
Zlib.c: In function ‘XS_Compress__Raw__Zlib__inflateStream_inflateCount’:
Zlib.c: In function ‘XS_Compress__Raw__Zlib__inflateStream_compressedBytes’:
Zlib.c: In function ‘XS_Compress__Raw__Zlib__inflateStream_uncompressedBytes’:
Zlib.c: In function ‘XS_Compress__Raw__Zlib__inflateStream_inflateSync’:
Zlib.c: In function ‘XS_Compress__Raw__Zlib__inflateStream_DESTROY’:
Zlib.c: In function ‘XS_Compress__Raw__Zlib__inflateStream_status’:
Zlib.c: In function ‘XS_Compress__Raw__Zlib__inflateStream_crc32’:
Zlib.c: In function ‘XS_Compress__Raw__Zlib__inflateStream_dict_adler’:
Zlib.c: In function ‘XS_Compress__Raw__Zlib__inflateStream_total_in’:
Zlib.c: In function ‘XS_Compress__Raw__Zlib__inflateStream_adler32’:
Zlib.c: In function ‘XS_Compress__Raw__Zlib__inflateStream_total_out’:
Zlib.c: In function ‘XS_Compress__Raw__Zlib__inflateStream_msg’:
Zlib.c: In function ‘XS_Compress__Raw__Zlib__inflateStream_get_Bufsize’:
Zlib.c: In function ‘XS_Compress__Raw__Zlib__inflateStream_set_Append’:
Zlib.c: In function ‘XS_Compress__Raw__Zlib__inflateScanStream_DESTROY’:
Zlib.c: In function ‘XS_Compress__Raw__Zlib__inflateScanStream_DispStream’:
Zlib.c: In function ‘XS_Compress__Raw__Zlib__inflateScanStream_inflateReset’:
Zlib.c: In function ‘XS_Compress__Raw__Zlib__inflateScanStream_scan’:
Zlib.c: In function ‘XS_Compress__Raw__Zlib__inflateScanStream_getEndOffset’:
Zlib.c: In function ‘XS_Compress__Raw__Zlib__inflateScanStream_inflateCount’:
Zlib.c: In function ‘XS_Compress__Raw__Zlib__inflateScanStream_compressedBytes’:
Zlib.c: In function ‘XS_Compress__Raw__Zlib__inflateScanStream_uncompressedBytes’:
Zlib.c: In function ‘XS_Compress__Raw__Zlib__inflateScanStream_getLastBlockOffset’:
Zlib.c: In function ‘XS_Compress__Raw__Zlib__inflateScanStream_getLastBufferOffset’:
Zlib.c: In function ‘XS_Compress__Raw__Zlib__inflateScanStream_resetLastBlockByte’:
Zlib.c: In function ‘XS_Compress__Raw__Zlib__inflateScanStream__createDeflateStream’:
Zlib.c: In function ‘XS_Compress__Raw__Zlib__inflateScanStream_status’:
Zlib.c: In function ‘XS_Compress__Raw__Zlib__inflateScanStream_crc32’:
Zlib.c: In function ‘XS_Compress__Raw__Zlib__inflateScanStream_adler32’:
Zlib.c: In function ‘boot_Compress__Raw__Zlib’:
Cwd.xs: In function ‘THX_invocant_is_unix’:
ppport.h:6145:26: warning: ISO C forbids braced-groups within expressions [-Wpedantic]
Cwd.xs: In function ‘THX_unix_canonpath’:
ppport.h:4269:31: warning: ISO C forbids braced-groups within expressions [-Wpedantic]
Cwd.xs: In function ‘XS_Cwd_CLONE’:
Cwd.c: In function ‘XS_Cwd_getcwd’:
Cwd.xs: In function ‘XS_Cwd_abs_path’:
Cwd.c: In function ‘XS_File__Spec__Unix_canonpath’:
Cwd.c: In function ‘XS_File__Spec__Unix__fn_canonpath’:
Cwd.xs: In function ‘XS_File__Spec__Unix_catdir’:
Cwd.xs: In function ‘XS_File__Spec__Unix__fn_catdir’:
Cwd.xs: In function ‘XS_File__Spec__Unix_catfile’:
Cwd.xs: In function ‘XS_File__Spec__Unix__fn_catfile’:
Cwd.c: In function ‘boot_Cwd’:
Cwd.c:1102:5: warning: "XSubPPtmpAAAB" is not defined [-Wundef]
Cwd.xs:556:5: warning: "XSubPPtmpAAAB" is not defined [-Wundef]
Bzip2.xs:122:6: warning: no previous prototype for ‘bz_internal_error’ [-Wmissing-prototypes]
Bzip2.xs: In function ‘DispStream’:
Bzip2.xs:184:5: warning: format ‘%p’ expects argument of type ‘void *’, but argument 2 has type ‘struct di_stream *’ [-Wformat=]
Bzip2.xs:193:9: warning: format ‘%p’ expects argument of type ‘void *’, but argument 2 has type ‘struct bz_stream *’ [-Wformat=]
Bzip2.xs: In function ‘deRef’:
Bzip2.xs: In function ‘deRef_l’:
Bzip2.c: In function ‘XS_Compress__Raw__Bzip2_constant’:
Bzip2.c: In function ‘XS_Compress__Raw__Bzip2_bzlibversion’:
Bzip2.c: In function ‘XS_Compress__Raw__Bzip2_new’:
Bzip2.c: In function ‘XS_Compress__Raw__Bunzip2_new’:
Bzip2.c: In function ‘XS_Compress__Raw__Bzip2_DispStream’:
Bzip2.c: In function ‘XS_Compress__Raw__Bzip2_bzdeflate’:
Bzip2.c: In function ‘XS_Compress__Raw__Bzip2_DESTROY’:
Bzip2.c: In function ‘XS_Compress__Raw__Bzip2_bzclose’:
Bzip2.c: In function ‘XS_Compress__Raw__Bzip2_bzflush’:
Bzip2.c: In function ‘XS_Compress__Raw__Bzip2_total_in_lo32’:
Bzip2.c: In function ‘XS_Compress__Raw__Bzip2_total_out_lo32’:
Bzip2.c: In function ‘XS_Compress__Raw__Bzip2_compressedBytes’:
Bzip2.c: In function ‘XS_Compress__Raw__Bzip2_uncompressedBytes’:
Bzip2.c: In function ‘XS_Compress__Raw__Bunzip2_DispStream’:
Bzip2.c: In function ‘XS_Compress__Raw__Bunzip2_bzinflate’:
Bzip2.c: In function ‘XS_Compress__Raw__Bunzip2_inflateCount’:
Bzip2.c: In function ‘XS_Compress__Raw__Bunzip2_DESTROY’:
Bzip2.c: In function ‘XS_Compress__Raw__Bunzip2_status’:
Bzip2.c: In function ‘XS_Compress__Raw__Bunzip2_total_in_lo32’:
Bzip2.c: In function ‘XS_Compress__Raw__Bunzip2_total_out_lo32’:
Bzip2.c: In function ‘XS_Compress__Raw__Bunzip2_compressedBytes’:
Bzip2.c: In function ‘XS_Compress__Raw__Bunzip2_uncompressedBytes’:
Dumper.xs: In function ‘esc_q_utf8’:
Dumper.xs: In function ‘sv_x’:
Dumper.xs: In function ‘DD_dump’:
Dumper.xs:550:3: warning: format ‘%p’ expects argument of type ‘void *’, but argument 2 has type ‘struct SV *’ [-Wformat=]
Dumper.xs:888:17: warning: declaration of ‘iname’ shadows a previous local [-Wshadow]
Dumper.xs:512:11: warning: shadowed declaration is here [-Wshadow]
Dumper.xs:989:13: warning: declaration of ‘key’ shadows a previous local [-Wshadow]
Dumper.xs:883:12: warning: shadowed declaration is here [-Wshadow]
Dumper.xs:1140:9: warning: declaration of ‘i’ shadows a previous local [-Wshadow]
Dumper.xs:500:12: warning: shadowed declaration is here [-Wshadow]
../../perl.h:1581:52: warning: declaration of ‘len’ shadows a previous local [-Wshadow]
Dumper.xs:1183:20: warning: shadowed declaration is here [-Wshadow]
../../perl.h:1581:45: warning: ISO C forbids braced-groups within expressions [-Wpedantic]
../../gv.h:60:26: warning: ISO C forbids braced-groups within expressions [-Wpedantic]
Dumper.xs: In function ‘XS_Data__Dumper_Dumpxs’:
Dumper.xs:1558:12: warning: declaration of ‘i’ shadows a previous local [-Wshadow]
Dumper.xs:1368:14: warning: shadowed declaration is here [-Wshadow]
Dumper.c: In function ‘XS_Data__Dumper__vstring’:
version.c:34:1: warning: no previous prototype for ‘__getBerkeleyDBInfo’ [-Wmissing-prototypes]
DB_File.xs:128:5: warning: function declaration isn’t a prototype [-Wstrict-prototypes]
DB_File.xs: In function ‘btree_compare’:
../../scope.h:236:29: warning: cast increases required alignment of target type [-Wcast-align]
../../sv.h:1758:21: warning: ISO C forbids braced-groups within expressions [-Wpedantic]
DB_File.xs: In function ‘btree_prefix’:
DB_File.xs: In function ‘hash_cb’:
DB_File.xs: In function ‘ParseOpenInfo’:
DB_File.xs:1407:7: warning: declaration of ‘flags’ shadows a parameter [-Wshadow]
DB_File.xs:984:49: warning: shadowed declaration is here [-Wshadow]
DB_File.xs:1483:14: warning: declaration of ‘status’ shadows a previous local [-Wshadow]
DB_File.xs:1277:10: warning: shadowed declaration is here [-Wshadow]
DB_File.c: In function ‘XS_DB_File_constant’:
DB_File.c: In function ‘XS_DB_File_DoTie_’:
DB_File.c: In function ‘XS_DB_File_DESTROY’:
DB_File.c: In function ‘XS_DB_File_DELETE’:
DB_File.c: In function ‘XS_DB_File_EXISTS’:
DB_File.c: In function ‘XS_DB_File_FETCH’:
DB_File.c: In function ‘XS_DB_File_STORE’:
DB_File.c: In function ‘XS_DB_File_FIRSTKEY’:
DB_File.c: In function ‘XS_DB_File_NEXTKEY’:
DB_File.c: In function ‘XS_DB_File_unshift’:
DB_File.c: In function ‘XS_DB_File_pop’:
DB_File.c: In function ‘XS_DB_File_shift’:
DB_File.c: In function ‘XS_DB_File_push’:
DB_File.c: In function ‘XS_DB_File_length’:
DB_File.c: In function ‘XS_DB_File_del’:
DB_File.c: In function ‘XS_DB_File_get’:
DB_File.c: In function ‘XS_DB_File_put’:
DB_File.c: In function ‘XS_DB_File_fd’:
DB_File.c: In function ‘XS_DB_File_sync’:
DB_File.c: In function ‘XS_DB_File_seq’:
DB_File.c: In function ‘XS_DB_File_filter_fetch_key’:
DB_File.c: In function ‘XS_DB_File_filter_store_key’:
DB_File.c: In function ‘XS_DB_File_filter_fetch_value’:
DB_File.c: In function ‘XS_DB_File_filter_store_value’:
DB_File.c: In function ‘boot_DB_File’:
Peek.xs: In function ‘DeadCode’:
Peek.xs: In function ‘S_do_dump’:
Peek.xs: In function ‘S_pp_dump’:
Peek.c: In function ‘XS_Devel__Peek_mstat’:
Peek.c: In function ‘XS_Devel__Peek_fill_mstats’:
Peek.c: In function ‘XS_Devel__Peek_mstats_fillhash’:
Peek.c: In function ‘XS_Devel__Peek_mstats2hash’:
Peek.c: In function ‘XS_Devel__Peek_Dump’:
Peek.c: In function ‘XS_Devel__Peek_DumpArray’:
Peek.xs: In function ‘XS_Devel__Peek_SvREFCNT’:
Peek.c: In function ‘XS_Devel__Peek_DeadCode’:
Peek.c: In function ‘XS_Devel__Peek_CvGV’:
Peek.c:802:7: warning: declaration of ‘cv’ shadows a parameter [-Wshadow]
Peek.c: In function ‘XS_Devel__Peek_runops_debug’:
Peek.xs: In function ‘boot_Devel__Peek’:
Peek.xs:445:16: warning: declaration of ‘cv’ shadows a parameter [-Wshadow]
MD5.xs:159:1: warning: ‘static’ is not at beginning of declaration [-Wold-style-declaration]
MD5.xs: In function ‘MD5Transform’:
MD5.xs:283:20: warning: cast increases required alignment of target type [-Wcast-align]
MD5.xs: In function ‘MD5Final’:
MD5.xs:472:6: warning: cast increases required alignment of target type [-Wcast-align]
MD5.xs:473:6: warning: cast increases required alignment of target type [-Wcast-align]
MD5.xs:485:6: warning: cast increases required alignment of target type [-Wcast-align]
MD5.xs:486:6: warning: cast increases required alignment of target type [-Wcast-align]
MD5.xs:487:6: warning: cast increases required alignment of target type [-Wcast-align]
MD5.xs:488:6: warning: cast increases required alignment of target type [-Wcast-align]
MD5.xs: In function ‘get_md5_ctx’:
MD5.xs:511:13: warning: cast increases required alignment of target type [-Wcast-align]
MD5.xs: In function ‘XS_Digest__MD5_new’:
MD5.xs: In function ‘XS_Digest__MD5_clone’:
MD5.c: In function ‘XS_Digest__MD5_DESTROY’:
MD5.xs: In function ‘XS_Digest__MD5_add’:
MD5.xs: In function ‘XS_Digest__MD5_addfile’:
MD5.c: In function ‘XS_Digest__MD5_digest’:
MD5.xs: In function ‘XS_Digest__MD5_context’:
MD5.c: In function ‘XS_Digest__MD5_md5’:
MD5.c: In function ‘boot_Digest__MD5’:
MD5.c:1119:14: warning: declaration of ‘cv’ shadows a parameter [-Wshadow]
module2.c:30:6: warning: no previous prototype for ‘call_newCONSTSUB_2’ [-Wmissing-prototypes]
module2.c:35:5: warning: no previous prototype for ‘get_PL_signals_2’ [-Wmissing-prototypes]
module2.c:40:5: warning: no previous prototype for ‘no_dummy_parser_vars’ [-Wmissing-prototypes]
module3.c:31:5: warning: no previous prototype for ‘exception’ [-Wmissing-prototypes]
module3.c: In function ‘exception’:
module3.c:52:6: warning: no previous prototype for ‘call_newCONSTSUB_3’ [-Wmissing-prototypes]
module3.c:57:5: warning: no previous prototype for ‘get_PL_signals_3’ [-Wmissing-prototypes]
module3.c:62:5: warning: no previous prototype for ‘dummy_parser_warning’ [-Wmissing-prototypes]
RealPPPort.xs:206:6: warning: no previous prototype for ‘call_newCONSTSUB_1’ [-Wmissing-prototypes]
RealPPPort.xs: In function ‘XS_Devel__PPPort_dXSTARG’:
RealPPPort.xs: In function ‘XS_Devel__PPPort_dAXMARK’:
RealPPPort.xs:251:5: warning: no previous prototype for ‘get_PL_signals_1’ [-Wmissing-prototypes]
RealPPPort.xs: In function ‘XS_Devel__PPPort_mPUSHs’:
RealPPPort.xs: In function ‘XS_Devel__PPPort_mPUSHp’:
RealPPPort.xs: In function ‘XS_Devel__PPPort_mPUSHn’:
RealPPPort.xs: In function ‘XS_Devel__PPPort_mPUSHi’:
RealPPPort.xs: In function ‘XS_Devel__PPPort_mPUSHu’:
RealPPPort.xs: In function ‘XS_Devel__PPPort_mXPUSHs’:
RealPPPort.xs: In function ‘XS_Devel__PPPort_mXPUSHp’:
RealPPPort.xs: In function ‘XS_Devel__PPPort_mXPUSHn’:
RealPPPort.xs: In function ‘XS_Devel__PPPort_mXPUSHi’:
RealPPPort.xs: In function ‘XS_Devel__PPPort_mXPUSHu’:
RealPPPort.c: In function ‘XS_Devel__PPPort_sv_setuv’:
RealPPPort.c: In function ‘XS_Devel__PPPort_newSVuv’:
RealPPPort.c: In function ‘XS_Devel__PPPort_sv_2uv’:
RealPPPort.xs: In function ‘XS_Devel__PPPort_SvUVx’:
../../sv.h:1759:21: warning: ISO C forbids braced-groups within expressions [-Wpedantic]
RealPPPort.xs: In function ‘XS_Devel__PPPort_XSRETURN_UV’:
RealPPPort.xs: In function ‘XS_Devel__PPPort_PUSHu’:
RealPPPort.xs: In function ‘XS_Devel__PPPort_XPUSHu’:
RealPPPort.c: In function ‘XS_Devel__PPPort_HvNAME_get’:
RealPPPort.c: In function ‘XS_Devel__PPPort_HvNAMELEN_get’:
RealPPPort.xs: In function ‘XS_Devel__PPPort_newSVpvn’:
RealPPPort.xs: In function ‘XS_Devel__PPPort_newSVpvn_flags’:
RealPPPort.xs: In function ‘XS_Devel__PPPort_newSVpvn_utf8’:
RealPPPort.xs: In function ‘XS_Devel__PPPort_grok_number’:
RealPPPort.xs: In function ‘XS_Devel__PPPort_grok_bin’:
RealPPPort.xs: In function ‘XS_Devel__PPPort_grok_hex’:
RealPPPort.xs: In function ‘XS_Devel__PPPort_grok_oct’:
RealPPPort.xs: In function ‘XS_Devel__PPPort_Perl_grok_number’:
RealPPPort.xs: In function ‘XS_Devel__PPPort_Perl_grok_bin’:
RealPPPort.xs: In function ‘XS_Devel__PPPort_Perl_grok_hex’:
RealPPPort.xs: In function ‘XS_Devel__PPPort_Perl_grok_oct’:
RealPPPort.xs: In function ‘XS_Devel__PPPort_new_with_other_mg’:
RealPPPort.xs: In function ‘XS_Devel__PPPort_new_with_mg’:
RealPPPort.xs: In function ‘XS_Devel__PPPort_remove_null_magic’:
RealPPPort.xs: In function ‘XS_Devel__PPPort_remove_other_magic’:
RealPPPort.xs: In function ‘XS_Devel__PPPort_as_string’:
RealPPPort.c: In function ‘XS_Devel__PPPort_sv_catpv_mg’:
RealPPPort.xs: In function ‘XS_Devel__PPPort_sv_catpvn_mg’:
RealPPPort.c: In function ‘XS_Devel__PPPort_sv_catsv_mg’:
RealPPPort.c: In function ‘XS_Devel__PPPort_sv_setiv_mg’:
RealPPPort.c: In function ‘XS_Devel__PPPort_sv_setnv_mg’:
RealPPPort.c: In function ‘XS_Devel__PPPort_sv_setpv_mg’:
RealPPPort.xs: In function ‘XS_Devel__PPPort_sv_setpvn_mg’:
RealPPPort.c: In function ‘XS_Devel__PPPort_sv_setsv_mg’:
RealPPPort.c: In function ‘XS_Devel__PPPort_sv_setuv_mg’:
RealPPPort.xs: In function ‘XS_Devel__PPPort_sv_usepvn_mg’:
RealPPPort.c: In function ‘XS_Devel__PPPort_SvVSTRING_mg’:
RealPPPort.c: In function ‘XS_Devel__PPPort_sv_magic_portable’:
RealPPPort.xs: In function ‘XS_Devel__PPPort_GvSVn’:
RealPPPort.c: In function ‘XS_Devel__PPPort_isGV_with_GP’:
RealPPPort.c: In function ‘XS_Devel__PPPort_get_cvn_flags’:
RealPPPort.c: In function ‘XS_Devel__PPPort_gv_fetchpvn_flags’:
RealPPPort.c: In function ‘XS_Devel__PPPort_gv_fetchsv’:
RealPPPort.xs: In function ‘XS_Devel__PPPort_newRV_inc_REFCNT’:
RealPPPort.c: In function ‘XS_Devel__PPPort_newRV_noinc_REFCNT’:
RealPPPort.c: In function ‘XS_Devel__PPPort_exception’:
RealPPPort.c: In function ‘XS_Devel__PPPort_G_SCALAR’:
RealPPPort.c: In function ‘XS_Devel__PPPort_G_ARRAY’:
RealPPPort.c: In function ‘XS_Devel__PPPort_G_DISCARD’:
RealPPPort.c: In function ‘XS_Devel__PPPort_eval_sv’:
RealPPPort.c: In function ‘XS_Devel__PPPort_eval_pv’:
RealPPPort.c: In function ‘XS_Devel__PPPort_call_sv’:
RealPPPort.c: In function ‘XS_Devel__PPPort_call_pv’:
RealPPPort.c: In function ‘XS_Devel__PPPort_call_argv’:
RealPPPort.c: In function ‘XS_Devel__PPPort_call_method’:
RealPPPort.c: In function ‘XS_Devel__PPPort_call_sv_G_METHOD’:
RealPPPort.c: In function ‘XS_Devel__PPPort_load_module’:
RealPPPort.c: In function ‘XS_Devel__PPPort_MY_CXT_1’:
RealPPPort.c: In function ‘XS_Devel__PPPort_MY_CXT_2’:
RealPPPort.xs: In function ‘XS_Devel__PPPort_MY_CXT_CLONE’:
RealPPPort.xs: In function ‘XS_Devel__PPPort_newSVpvs’:
RealPPPort.xs: In function ‘XS_Devel__PPPort_newSVpvs_flags’:
RealPPPort.xs: In function ‘XS_Devel__PPPort_newSVpvs_share’:
../../sv.h:1807:3: warning: cast increases required alignment of target type [-Wcast-align]
RealPPPort.xs: In function ‘XS_Devel__PPPort_hv_fetchs’:
RealPPPort.xs: In function ‘XS_Devel__PPPort_hv_stores’:
RealPPPort.c: In function ‘XS_Devel__PPPort_gv_fetchpvs’:
RealPPPort.c: In function ‘XS_Devel__PPPort_gv_stashpvs’:
RealPPPort.c: In function ‘XS_Devel__PPPort_get_cvs’:
RealPPPort.xs: In function ‘XS_Devel__PPPort_pv_escape_can_unicode’:
RealPPPort.xs: In function ‘XS_Devel__PPPort_pv_pretty’:
RealPPPort.xs: In function ‘XS_Devel__PPPort_pv_display’:
RealPPPort.c: In function ‘XS_Devel__PPPort_TestSvUV_set’:
RealPPPort.c: In function ‘XS_Devel__PPPort_TestSvPVX_const’:
RealPPPort.c: In function ‘XS_Devel__PPPort_TestSvPVX_mutable’:
RealPPPort.c: In function ‘XS_Devel__PPPort_TestSvSTASH_set’:
ppport.h:6145:35: warning: declaration of ‘_p’ shadows a previous local [-Wshadow]
ppport.h:6145:35: warning: shadowed declaration is here [-Wshadow]
RealPPPort.xs: In function ‘XS_Devel__PPPort_newSV_type’:
RealPPPort.c: In function ‘XS_Devel__PPPort_croak_NVgf’:
RealPPPort.c: In function ‘XS_Devel__PPPort_CopSTASHPV’:
RealPPPort.c: In function ‘XS_Devel__PPPort_CopFILE’:
RealPPPort.c: In function ‘XS_Devel__PPPort_caller_cx’:
RealPPPort.xs: In function ‘XS_Devel__PPPort_my_strlfunc’:
RealPPPort.c: In function ‘XS_Devel__PPPort_vnewSVpvf’:
RealPPPort.c: In function ‘XS_Devel__PPPort_sv_vcatpvf’:
RealPPPort.c: In function ‘XS_Devel__PPPort_sv_vsetpvf’:
RealPPPort.c: In function ‘XS_Devel__PPPort_sv_catpvf_mg’:
RealPPPort.c: In function ‘XS_Devel__PPPort_Perl_sv_catpvf_mg’:
RealPPPort.c: In function ‘XS_Devel__PPPort_sv_catpvf_mg_nocontext’:
RealPPPort.c: In function ‘XS_Devel__PPPort_sv_setpvf_mg’:
RealPPPort.c: In function ‘XS_Devel__PPPort_Perl_sv_setpvf_mg’:
RealPPPort.c: In function ‘XS_Devel__PPPort_sv_setpvf_mg_nocontext’:
RealPPPort.c: In function ‘XS_Devel__PPPort_iv_size’:
RealPPPort.c: In function ‘XS_Devel__PPPort_uv_size’:
RealPPPort.c: In function ‘XS_Devel__PPPort_iv_type’:
RealPPPort.c: In function ‘XS_Devel__PPPort_uv_type’:
RealPPPort.xs: In function ‘XS_Devel__PPPort_my_sprintf’:
RealPPPort.xs: In function ‘XS_Devel__PPPort_SvPVbyte’:
RealPPPort.xs: In function ‘XS_Devel__PPPort_SvPV_nolen’:
RealPPPort.xs: In function ‘XS_Devel__PPPort_SvPV_const’:
RealPPPort.xs: In function ‘XS_Devel__PPPort_SvPV_mutable’:
RealPPPort.xs: In function ‘XS_Devel__PPPort_SvPV_flags’:
RealPPPort.xs: In function ‘XS_Devel__PPPort_SvPV_flags_const’:
RealPPPort.c: In function ‘XS_Devel__PPPort_SvPV_flags_const_nolen’:
RealPPPort.xs: In function ‘XS_Devel__PPPort_SvPV_flags_mutable’:
RealPPPort.xs: In function ‘XS_Devel__PPPort_SvPV_force’:
RealPPPort.xs: In function ‘XS_Devel__PPPort_SvPV_force_nolen’:
RealPPPort.xs: In function ‘XS_Devel__PPPort_SvPV_force_mutable’:
RealPPPort.xs: In function ‘XS_Devel__PPPort_SvPV_force_nomg’:
RealPPPort.xs: In function ‘XS_Devel__PPPort_SvPV_force_nomg_nolen’:
RealPPPort.xs: In function ‘XS_Devel__PPPort_SvPV_force_flags’:
RealPPPort.xs: In function ‘XS_Devel__PPPort_SvPV_force_flags_nolen’:
RealPPPort.xs: In function ‘XS_Devel__PPPort_SvPV_force_flags_mutable’:
RealPPPort.c: In function ‘XS_Devel__PPPort_SvPV_nolen_const’:
RealPPPort.xs: In function ‘XS_Devel__PPPort_SvPV_nomg’:
RealPPPort.xs: In function ‘XS_Devel__PPPort_SvPV_nomg_const’:
RealPPPort.c: In function ‘XS_Devel__PPPort_SvPV_nomg_const_nolen’:
RealPPPort.xs: In function ‘XS_Devel__PPPort_SvPV_nomg_nolen’:
RealPPPort.c: In function ‘XS_Devel__PPPort_SvPV_renew’:
RealPPPort.xs: In function ‘XS_Devel__PPPort_my_snprintf’:
RealPPPort.xs:1836:21: warning: shadowed declaration is here [-Wshadow]
RealPPPort.c: In function ‘XS_Devel__PPPort_call_newCONSTSUB_1’:
RealPPPort.c: In function ‘XS_Devel__PPPort_call_newCONSTSUB_2’:
RealPPPort.c: In function ‘XS_Devel__PPPort_call_newCONSTSUB_3’:
RealPPPort.xs: In function ‘XS_Devel__PPPort_ptrtests’:
RealPPPort.xs:1871:37: warning: comparing floating point with == or != is unsafe [-Wfloat-equal]
RealPPPort.c: In function ‘XS_Devel__PPPort_gv_stashpvn’:
RealPPPort.c: In function ‘XS_Devel__PPPort_get_sv’:
RealPPPort.c: In function ‘XS_Devel__PPPort_get_av’:
RealPPPort.c: In function ‘XS_Devel__PPPort_get_hv’:
RealPPPort.c: In function ‘XS_Devel__PPPort_get_cv’:
RealPPPort.c: In function ‘XS_Devel__PPPort_xsreturn’:
RealPPPort.c: In function ‘XS_Devel__PPPort_boolSV’:
RealPPPort.xs: In function ‘XS_Devel__PPPort_DEFSV’:
RealPPPort.xs: In function ‘XS_Devel__PPPort_DEFSV_modify’:
RealPPPort.xs: In function ‘XS_Devel__PPPort_ERRSV’:
RealPPPort.c: In function ‘XS_Devel__PPPort_UNDERBAR’:
RealPPPort.xs: In function ‘XS_Devel__PPPort_prepush’:
RealPPPort.c: In function ‘XS_Devel__PPPort_PERL_ABS’:
RealPPPort.xs: In function ‘XS_Devel__PPPort_SVf’:
RealPPPort.c: In function ‘XS_Devel__PPPort_Perl_ppaddr_t’:
RealPPPort.xs: In function ‘XS_Devel__PPPort_check_HeUTF8’:
RealPPPort.c: In function ‘XS_Devel__PPPort_warner’:
RealPPPort.c: In function ‘XS_Devel__PPPort_Perl_warner’:
RealPPPort.c: In function ‘XS_Devel__PPPort_Perl_warner_nocontext’:
RealPPPort.c: In function ‘XS_Devel__PPPort_ckWARN’:
RealPPPort.c: In function ‘XS_Devel__PPPort_checkmem’:
RealPPPort.xs: In function ‘XS_Devel__PPPort_newSVpvn_share’:
RealPPPort.xs: In function ‘XS_Devel__PPPort_SvREFCNT’:
RealPPPort.c: In function ‘XS_Devel__PPPort_no_THX_arg’:
RealPPPort.c: In function ‘XS_Devel__PPPort_with_THX_arg’:
RealPPPort.c: In function ‘XS_Devel__PPPort_compare_PL_signals’:
RealPPPort.c: In function ‘XS_Devel__PPPort_PL_sv_undef’:
RealPPPort.c: In function ‘XS_Devel__PPPort_PL_sv_yes’:
RealPPPort.c: In function ‘XS_Devel__PPPort_PL_sv_no’:
RealPPPort.c: In function ‘XS_Devel__PPPort_PL_na’:
RealPPPort.c: In function ‘XS_Devel__PPPort_PL_Sv’:
RealPPPort.c: In function ‘XS_Devel__PPPort_PL_tokenbuf’:
RealPPPort.c: In function ‘XS_Devel__PPPort_PL_parser’:
RealPPPort.c: In function ‘XS_Devel__PPPort_PL_hexdigit’:
RealPPPort.c: In function ‘XS_Devel__PPPort_PL_hints’:
RealPPPort.c: In function ‘XS_Devel__PPPort_PL_ppaddr’:
RealPPPort.xs: In function ‘XS_Devel__PPPort_other_variables’:
RealPPPort.c: In function ‘XS_Devel__PPPort_no_dummy_parser_vars’:
RealPPPort.c: In function ‘XS_Devel__PPPort_dummy_parser_warning’:
src/sha.h:58:30: warning: ISO C90 does not support ‘long long’ [-Wlong-long]
src/sha64bit.c:38:5: warning: use of C99 long long integer constant [-Wlong-long]
src/sha64bit.c:38:30: warning: use of C99 long long integer constant [-Wlong-long]
src/sha64bit.c:38:55: warning: use of C99 long long integer constant [-Wlong-long]
src/sha64bit.c:39:5: warning: use of C99 long long integer constant [-Wlong-long]
src/sha64bit.c:39:30: warning: use of C99 long long integer constant [-Wlong-long]
src/sha64bit.c:39:55: warning: use of C99 long long integer constant [-Wlong-long]
src/sha64bit.c:40:5: warning: use of C99 long long integer constant [-Wlong-long]
src/sha64bit.c:40:30: warning: use of C99 long long integer constant [-Wlong-long]
src/sha64bit.c:40:55: warning: use of C99 long long integer constant [-Wlong-long]
src/sha64bit.c:41:5: warning: use of C99 long long integer constant [-Wlong-long]
src/sha64bit.c:41:30: warning: use of C99 long long integer constant [-Wlong-long]
src/sha64bit.c:41:55: warning: use of C99 long long integer constant [-Wlong-long]
src/sha64bit.c:42:5: warning: use of C99 long long integer constant [-Wlong-long]
src/sha64bit.c:42:30: warning: use of C99 long long integer constant [-Wlong-long]
src/sha64bit.c:42:55: warning: use of C99 long long integer constant [-Wlong-long]
src/sha64bit.c:43:5: warning: use of C99 long long integer constant [-Wlong-long]
src/sha64bit.c:43:30: warning: use of C99 long long integer constant [-Wlong-long]
src/sha64bit.c:43:55: warning: use of C99 long long integer constant [-Wlong-long]
src/sha64bit.c:44:5: warning: use of C99 long long integer constant [-Wlong-long]
src/sha64bit.c:44:30: warning: use of C99 long long integer constant [-Wlong-long]
src/sha64bit.c:44:55: warning: use of C99 long long integer constant [-Wlong-long]
src/sha64bit.c:45:5: warning: use of C99 long long integer constant [-Wlong-long]
src/sha64bit.c:45:30: warning: use of C99 long long integer constant [-Wlong-long]
src/sha64bit.c:45:55: warning: use of C99 long long integer constant [-Wlong-long]
src/sha64bit.c:46:5: warning: use of C99 long long integer constant [-Wlong-long]
src/sha64bit.c:46:30: warning: use of C99 long long integer constant [-Wlong-long]
src/sha64bit.c:46:55: warning: use of C99 long long integer constant [-Wlong-long]
src/sha64bit.c:47:5: warning: use of C99 long long integer constant [-Wlong-long]
src/sha64bit.c:47:30: warning: use of C99 long long integer constant [-Wlong-long]
src/sha64bit.c:47:55: warning: use of C99 long long integer constant [-Wlong-long]
src/sha64bit.c:48:5: warning: use of C99 long long integer constant [-Wlong-long]
src/sha64bit.c:48:30: warning: use of C99 long long integer constant [-Wlong-long]
src/sha64bit.c:48:55: warning: use of C99 long long integer constant [-Wlong-long]
src/sha64bit.c:49:5: warning: use of C99 long long integer constant [-Wlong-long]
src/sha64bit.c:49:30: warning: use of C99 long long integer constant [-Wlong-long]
src/sha64bit.c:49:55: warning: use of C99 long long integer constant [-Wlong-long]
src/sha64bit.c:50:5: warning: use of C99 long long integer constant [-Wlong-long]
src/sha64bit.c:50:30: warning: use of C99 long long integer constant [-Wlong-long]
src/sha64bit.c:50:55: warning: use of C99 long long integer constant [-Wlong-long]
src/sha64bit.c:51:5: warning: use of C99 long long integer constant [-Wlong-long]
src/sha64bit.c:51:30: warning: use of C99 long long integer constant [-Wlong-long]
src/sha64bit.c:51:55: warning: use of C99 long long integer constant [-Wlong-long]
src/sha64bit.c:52:5: warning: use of C99 long long integer constant [-Wlong-long]
src/sha64bit.c:52:30: warning: use of C99 long long integer constant [-Wlong-long]
src/sha64bit.c:52:55: warning: use of C99 long long integer constant [-Wlong-long]
src/sha64bit.c:53:5: warning: use of C99 long long integer constant [-Wlong-long]
src/sha64bit.c:53:30: warning: use of C99 long long integer constant [-Wlong-long]
src/sha64bit.c:53:55: warning: use of C99 long long integer constant [-Wlong-long]
src/sha64bit.c:54:5: warning: use of C99 long long integer constant [-Wlong-long]
src/sha64bit.c:54:30: warning: use of C99 long long integer constant [-Wlong-long]
src/sha64bit.c:54:55: warning: use of C99 long long integer constant [-Wlong-long]
src/sha64bit.c:55:5: warning: use of C99 long long integer constant [-Wlong-long]
src/sha64bit.c:55:30: warning: use of C99 long long integer constant [-Wlong-long]
src/sha64bit.c:55:55: warning: use of C99 long long integer constant [-Wlong-long]
src/sha64bit.c:56:5: warning: use of C99 long long integer constant [-Wlong-long]
src/sha64bit.c:56:30: warning: use of C99 long long integer constant [-Wlong-long]
src/sha64bit.c:56:55: warning: use of C99 long long integer constant [-Wlong-long]
src/sha64bit.c:57:5: warning: use of C99 long long integer constant [-Wlong-long]
src/sha64bit.c:57:30: warning: use of C99 long long integer constant [-Wlong-long]
src/sha64bit.c:57:55: warning: use of C99 long long integer constant [-Wlong-long]
src/sha64bit.c:58:5: warning: use of C99 long long integer constant [-Wlong-long]
src/sha64bit.c:58:30: warning: use of C99 long long integer constant [-Wlong-long]
src/sha64bit.c:58:55: warning: use of C99 long long integer constant [-Wlong-long]
src/sha64bit.c:59:5: warning: use of C99 long long integer constant [-Wlong-long]
src/sha64bit.c:59:30: warning: use of C99 long long integer constant [-Wlong-long]
src/sha64bit.c:59:55: warning: use of C99 long long integer constant [-Wlong-long]
src/sha64bit.c:60:5: warning: use of C99 long long integer constant [-Wlong-long]
src/sha64bit.c:60:30: warning: use of C99 long long integer constant [-Wlong-long]
src/sha64bit.c:60:55: warning: use of C99 long long integer constant [-Wlong-long]
src/sha64bit.c:61:5: warning: use of C99 long long integer constant [-Wlong-long]
src/sha64bit.c:61:30: warning: use of C99 long long integer constant [-Wlong-long]
src/sha64bit.c:61:55: warning: use of C99 long long integer constant [-Wlong-long]
src/sha64bit.c:62:5: warning: use of C99 long long integer constant [-Wlong-long]
src/sha64bit.c:62:30: warning: use of C99 long long integer constant [-Wlong-long]
src/sha64bit.c:62:55: warning: use of C99 long long integer constant [-Wlong-long]
src/sha64bit.c:63:5: warning: use of C99 long long integer constant [-Wlong-long]
src/sha64bit.c:63:30: warning: use of C99 long long integer constant [-Wlong-long]
src/sha64bit.c:63:55: warning: use of C99 long long integer constant [-Wlong-long]
src/sha64bit.c:64:5: warning: use of C99 long long integer constant [-Wlong-long]
src/sha64bit.c:64:30: warning: use of C99 long long integer constant [-Wlong-long]
src/sha64bit.c:69:5: warning: use of C99 long long integer constant [-Wlong-long]
src/sha64bit.c:69:30: warning: use of C99 long long integer constant [-Wlong-long]
src/sha64bit.c:69:55: warning: use of C99 long long integer constant [-Wlong-long]
src/sha64bit.c:70:5: warning: use of C99 long long integer constant [-Wlong-long]
src/sha64bit.c:70:30: warning: use of C99 long long integer constant [-Wlong-long]
src/sha64bit.c:70:55: warning: use of C99 long long integer constant [-Wlong-long]
src/sha64bit.c:71:5: warning: use of C99 long long integer constant [-Wlong-long]
src/sha64bit.c:71:30: warning: use of C99 long long integer constant [-Wlong-long]
src/sha64bit.c:76:5: warning: use of C99 long long integer constant [-Wlong-long]
src/sha64bit.c:76:30: warning: use of C99 long long integer constant [-Wlong-long]
src/sha64bit.c:76:55: warning: use of C99 long long integer constant [-Wlong-long]
src/sha64bit.c:77:5: warning: use of C99 long long integer constant [-Wlong-long]
src/sha64bit.c:77:30: warning: use of C99 long long integer constant [-Wlong-long]
src/sha64bit.c:77:55: warning: use of C99 long long integer constant [-Wlong-long]
src/sha64bit.c:78:5: warning: use of C99 long long integer constant [-Wlong-long]
src/sha64bit.c:78:30: warning: use of C99 long long integer constant [-Wlong-long]
src/sha64bit.c:83:5: warning: use of C99 long long integer constant [-Wlong-long]
src/sha64bit.c:83:30: warning: use of C99 long long integer constant [-Wlong-long]
src/sha64bit.c:83:55: warning: use of C99 long long integer constant [-Wlong-long]
src/sha64bit.c:84:5: warning: use of C99 long long integer constant [-Wlong-long]
src/sha64bit.c:84:30: warning: use of C99 long long integer constant [-Wlong-long]
src/sha64bit.c:84:55: warning: use of C99 long long integer constant [-Wlong-long]
src/sha64bit.c:85:5: warning: use of C99 long long integer constant [-Wlong-long]
src/sha64bit.c:85:30: warning: use of C99 long long integer constant [-Wlong-long]
src/sha64bit.c:90:5: warning: use of C99 long long integer constant [-Wlong-long]
src/sha64bit.c:90:30: warning: use of C99 long long integer constant [-Wlong-long]
src/sha64bit.c:90:55: warning: use of C99 long long integer constant [-Wlong-long]
src/sha64bit.c:91:5: warning: use of C99 long long integer constant [-Wlong-long]
src/sha64bit.c:91:30: warning: use of C99 long long integer constant [-Wlong-long]
src/sha64bit.c:91:55: warning: use of C99 long long integer constant [-Wlong-long]
src/sha64bit.c:92:5: warning: use of C99 long long integer constant [-Wlong-long]
src/sha64bit.c:92:30: warning: use of C99 long long integer constant [-Wlong-long]
src/sha64bit.c: In function ‘sha512’:
src/sha.h:97:34: warning: declaration of ‘t’ shadows a previous local [-Wshadow]
src/sha64bit.c:100:6: warning: shadowed declaration is here [-Wshadow]
src/sha.c: In function ‘digcpy’:
src/sha.c: In function ‘statecpy’:
src/sha.c: In function ‘sharewind’:
SHA.xs: In function ‘getSHA’:
SHA.c: In function ‘XS_Digest__SHA_shainit’:
SHA.c: In function ‘XS_Digest__SHA_sharewind’:
SHA.c: In function ‘XS_Digest__SHA_shawrite’:
SHA.c: In function ‘XS_Digest__SHA_newSHA’:
SHA.xs: In function ‘XS_Digest__SHA_clone’:
SHA.c: In function ‘XS_Digest__SHA_DESTROY’:
SHA.c: In function ‘XS_Digest__SHA_sha1’:
SHA.c: In function ‘XS_Digest__SHA_hmac_sha1’:
SHA.c: In function ‘XS_Digest__SHA_hashsize’:
SHA.xs: In function ‘XS_Digest__SHA_add’:
SHA.c: In function ‘XS_Digest__SHA_digest’:
SHA.xs: In function ‘XS_Digest__SHA__getstate’:
SHA.xs: In function ‘XS_Digest__SHA__putstate’:
SHA.xs: In function ‘XS_Digest__SHA__addfilebin’:
SHA.xs: In function ‘XS_Digest__SHA__addfileuniv’:
SHA.c: In function ‘boot_Digest__SHA’:
byte_t.c:9:24: error: array size missing in ‘utf8_AdobeStandardEncoding’
byte_t.c:9:24: warning: uninitialized const ‘utf8_AdobeStandardEncoding’ is invalid in C++ [-Wc++-compat]
byte_t.c:10:24: error: array size missing in ‘utf8_MacArabic’
byte_t.c:10:24: warning: uninitialized const ‘utf8_MacArabic’ is invalid in C++ [-Wc++-compat]
byte_t.c:11:24: error: array size missing in ‘utf8_MacCentralEurRoman’
byte_t.c:11:24: warning: uninitialized const ‘utf8_MacCentralEurRoman’ is invalid in C++ [-Wc++-compat]
byte_t.c:12:24: error: array size missing in ‘utf8_MacCroatian’
byte_t.c:12:24: warning: uninitialized const ‘utf8_MacCroatian’ is invalid in C++ [-Wc++-compat]
byte_t.c:13:24: error: array size missing in ‘utf8_MacCyrillic’
byte_t.c:13:24: warning: uninitialized const ‘utf8_MacCyrillic’ is invalid in C++ [-Wc++-compat]
byte_t.c:14:24: error: array size missing in ‘utf8_MacFarsi’
byte_t.c:14:24: warning: uninitialized const ‘utf8_MacFarsi’ is invalid in C++ [-Wc++-compat]
byte_t.c:15:24: error: array size missing in ‘utf8_MacGreek’
byte_t.c:15:24: warning: uninitialized const ‘utf8_MacGreek’ is invalid in C++ [-Wc++-compat]
byte_t.c:16:24: error: array size missing in ‘utf8_MacHebrew’
byte_t.c:16:24: warning: uninitialized const ‘utf8_MacHebrew’ is invalid in C++ [-Wc++-compat]
byte_t.c:17:24: error: array size missing in ‘utf8_MacIcelandic’
byte_t.c:17:24: warning: uninitialized const ‘utf8_MacIcelandic’ is invalid in C++ [-Wc++-compat]
byte_t.c:18:24: error: array size missing in ‘utf8_MacRoman’
byte_t.c:18:24: warning: uninitialized const ‘utf8_MacRoman’ is invalid in C++ [-Wc++-compat]
byte_t.c:19:24: error: array size missing in ‘utf8_MacRomanian’
byte_t.c:19:24: warning: uninitialized const ‘utf8_MacRomanian’ is invalid in C++ [-Wc++-compat]
byte_t.c:20:24: error: array size missing in ‘utf8_MacRumanian’
byte_t.c:20:24: warning: uninitialized const ‘utf8_MacRumanian’ is invalid in C++ [-Wc++-compat]
byte_t.c:21:24: error: array size missing in ‘utf8_MacSami’
byte_t.c:21:24: warning: uninitialized const ‘utf8_MacSami’ is invalid in C++ [-Wc++-compat]
byte_t.c:22:24: error: array size missing in ‘utf8_MacThai’
byte_t.c:22:24: warning: uninitialized const ‘utf8_MacThai’ is invalid in C++ [-Wc++-compat]
byte_t.c:23:24: error: array size missing in ‘utf8_MacTurkish’
byte_t.c:23:24: warning: uninitialized const ‘utf8_MacTurkish’ is invalid in C++ [-Wc++-compat]
byte_t.c:24:24: error: array size missing in ‘utf8_cp1006’
byte_t.c:24:24: warning: uninitialized const ‘utf8_cp1006’ is invalid in C++ [-Wc++-compat]
byte_t.c:25:24: error: array size missing in ‘utf8_cp1250’
byte_t.c:25:24: warning: uninitialized const ‘utf8_cp1250’ is invalid in C++ [-Wc++-compat]
byte_t.c:26:24: error: array size missing in ‘utf8_cp1251’
byte_t.c:26:24: warning: uninitialized const ‘utf8_cp1251’ is invalid in C++ [-Wc++-compat]
byte_t.c:27:24: error: array size missing in ‘utf8_cp1252’
byte_t.c:27:24: warning: uninitialized const ‘utf8_cp1252’ is invalid in C++ [-Wc++-compat]
byte_t.c:28:24: error: array size missing in ‘utf8_cp1253’
byte_t.c:28:24: warning: uninitialized const ‘utf8_cp1253’ is invalid in C++ [-Wc++-compat]
byte_t.c:29:24: error: array size missing in ‘utf8_cp1254’
byte_t.c:29:24: warning: uninitialized const ‘utf8_cp1254’ is invalid in C++ [-Wc++-compat]
byte_t.c:30:24: error: array size missing in ‘utf8_cp1255’
byte_t.c:30:24: warning: uninitialized const ‘utf8_cp1255’ is invalid in C++ [-Wc++-compat]
byte_t.c:31:24: error: array size missing in ‘utf8_cp1256’
byte_t.c:31:24: warning: uninitialized const ‘utf8_cp1256’ is invalid in C++ [-Wc++-compat]
byte_t.c:32:24: error: array size missing in ‘utf8_cp1257’
byte_t.c:32:24: warning: uninitialized const ‘utf8_cp1257’ is invalid in C++ [-Wc++-compat]
byte_t.c:33:24: error: array size missing in ‘utf8_cp1258’
byte_t.c:33:24: warning: uninitialized const ‘utf8_cp1258’ is invalid in C++ [-Wc++-compat]
byte_t.c:34:24: error: array size missing in ‘utf8_cp424’
byte_t.c:34:24: warning: uninitialized const ‘utf8_cp424’ is invalid in C++ [-Wc++-compat]
byte_t.c:35:24: error: array size missing in ‘utf8_cp437’
byte_t.c:35:24: warning: uninitialized const ‘utf8_cp437’ is invalid in C++ [-Wc++-compat]
byte_t.c:36:24: error: array size missing in ‘utf8_cp737’
byte_t.c:36:24: warning: uninitialized const ‘utf8_cp737’ is invalid in C++ [-Wc++-compat]
byte_t.c:37:24: error: array size missing in ‘utf8_cp775’
byte_t.c:37:24: warning: uninitialized const ‘utf8_cp775’ is invalid in C++ [-Wc++-compat]
byte_t.c:38:24: error: array size missing in ‘utf8_cp850’
byte_t.c:38:24: warning: uninitialized const ‘utf8_cp850’ is invalid in C++ [-Wc++-compat]
byte_t.c:39:24: error: array size missing in ‘utf8_cp852’
byte_t.c:39:24: warning: uninitialized const ‘utf8_cp852’ is invalid in C++ [-Wc++-compat]
byte_t.c:40:24: error: array size missing in ‘utf8_cp855’
byte_t.c:40:24: warning: uninitialized const ‘utf8_cp855’ is invalid in C++ [-Wc++-compat]
byte_t.c:41:24: error: array size missing in ‘utf8_cp856’
byte_t.c:41:24: warning: uninitialized const ‘utf8_cp856’ is invalid in C++ [-Wc++-compat]
byte_t.c:42:24: error: array size missing in ‘utf8_cp857’
byte_t.c:42:24: warning: uninitialized const ‘utf8_cp857’ is invalid in C++ [-Wc++-compat]
byte_t.c:43:24: error: array size missing in ‘utf8_cp858’
byte_t.c:43:24: warning: uninitialized const ‘utf8_cp858’ is invalid in C++ [-Wc++-compat]
byte_t.c:44:24: error: array size missing in ‘utf8_cp860’
byte_t.c:44:24: warning: uninitialized const ‘utf8_cp860’ is invalid in C++ [-Wc++-compat]
byte_t.c:45:24: error: array size missing in ‘utf8_cp861’
byte_t.c:45:24: warning: uninitialized const ‘utf8_cp861’ is invalid in C++ [-Wc++-compat]
byte_t.c:46:24: error: array size missing in ‘utf8_cp862’
byte_t.c:46:24: warning: uninitialized const ‘utf8_cp862’ is invalid in C++ [-Wc++-compat]
byte_t.c:47:24: error: array size missing in ‘utf8_cp863’
byte_t.c:47:24: warning: uninitialized const ‘utf8_cp863’ is invalid in C++ [-Wc++-compat]
byte_t.c:48:24: error: array size missing in ‘utf8_cp864’
byte_t.c:48:24: warning: uninitialized const ‘utf8_cp864’ is invalid in C++ [-Wc++-compat]
byte_t.c:49:24: error: array size missing in ‘utf8_cp865’
byte_t.c:49:24: warning: uninitialized const ‘utf8_cp865’ is invalid in C++ [-Wc++-compat]
byte_t.c:50:24: error: array size missing in ‘utf8_cp866’
byte_t.c:50:24: warning: uninitialized const ‘utf8_cp866’ is invalid in C++ [-Wc++-compat]
byte_t.c:51:24: error: array size missing in ‘utf8_cp869’
byte_t.c:51:24: warning: uninitialized const ‘utf8_cp869’ is invalid in C++ [-Wc++-compat]
byte_t.c:52:24: error: array size missing in ‘utf8_cp874’
byte_t.c:52:24: warning: uninitialized const ‘utf8_cp874’ is invalid in C++ [-Wc++-compat]
byte_t.c:53:24: error: array size missing in ‘utf8_hp_roman8’
byte_t.c:53:24: warning: uninitialized const ‘utf8_hp_roman8’ is invalid in C++ [-Wc++-compat]
byte_t.c:54:24: error: array size missing in ‘utf8_iso_8859_2’
byte_t.c:54:24: warning: uninitialized const ‘utf8_iso_8859_2’ is invalid in C++ [-Wc++-compat]
byte_t.c:55:24: error: array size missing in ‘utf8_iso_8859_3’
byte_t.c:55:24: warning: uninitialized const ‘utf8_iso_8859_3’ is invalid in C++ [-Wc++-compat]
byte_t.c:56:24: error: array size missing in ‘utf8_iso_8859_4’
byte_t.c:56:24: warning: uninitialized const ‘utf8_iso_8859_4’ is invalid in C++ [-Wc++-compat]
byte_t.c:57:24: error: array size missing in ‘utf8_iso_8859_5’
byte_t.c:57:24: warning: uninitialized const ‘utf8_iso_8859_5’ is invalid in C++ [-Wc++-compat]
byte_t.c:58:24: error: array size missing in ‘utf8_iso_8859_6’
byte_t.c:58:24: warning: uninitialized const ‘utf8_iso_8859_6’ is invalid in C++ [-Wc++-compat]
byte_t.c:59:24: error: array size missing in ‘utf8_iso_8859_7’
byte_t.c:59:24: warning: uninitialized const ‘utf8_iso_8859_7’ is invalid in C++ [-Wc++-compat]
byte_t.c:60:24: error: array size missing in ‘utf8_iso_8859_8’
byte_t.c:60:24: warning: uninitialized const ‘utf8_iso_8859_8’ is invalid in C++ [-Wc++-compat]
byte_t.c:61:24: error: array size missing in ‘utf8_iso_8859_9’
byte_t.c:61:24: warning: uninitialized const ‘utf8_iso_8859_9’ is invalid in C++ [-Wc++-compat]
byte_t.c:62:24: error: array size missing in ‘utf8_iso_8859_10’
byte_t.c:62:24: warning: uninitialized const ‘utf8_iso_8859_10’ is invalid in C++ [-Wc++-compat]
byte_t.c:63:24: error: array size missing in ‘utf8_iso_8859_11’
byte_t.c:63:24: warning: uninitialized const ‘utf8_iso_8859_11’ is invalid in C++ [-Wc++-compat]
byte_t.c:64:24: error: array size missing in ‘utf8_iso_8859_13’
byte_t.c:64:24: warning: uninitialized const ‘utf8_iso_8859_13’ is invalid in C++ [-Wc++-compat]
byte_t.c:65:24: error: array size missing in ‘utf8_iso_8859_14’
byte_t.c:65:24: warning: uninitialized const ‘utf8_iso_8859_14’ is invalid in C++ [-Wc++-compat]
byte_t.c:66:24: error: array size missing in ‘utf8_iso_8859_15’
byte_t.c:66:24: warning: uninitialized const ‘utf8_iso_8859_15’ is invalid in C++ [-Wc++-compat]
byte_t.c:67:24: error: array size missing in ‘utf8_iso_8859_16’
byte_t.c:67:24: warning: uninitialized const ‘utf8_iso_8859_16’ is invalid in C++ [-Wc++-compat]
byte_t.c:68:24: error: array size missing in ‘utf8_koi8_f’
byte_t.c:68:24: warning: uninitialized const ‘utf8_koi8_f’ is invalid in C++ [-Wc++-compat]
byte_t.c:69:24: error: array size missing in ‘utf8_koi8_r’
byte_t.c:69:24: warning: uninitialized const ‘utf8_koi8_r’ is invalid in C++ [-Wc++-compat]
byte_t.c:70:24: error: array size missing in ‘utf8_koi8_u’
byte_t.c:70:24: warning: uninitialized const ‘utf8_koi8_u’ is invalid in C++ [-Wc++-compat]
byte_t.c:71:24: error: array size missing in ‘utf8_nextstep’
byte_t.c:71:24: warning: uninitialized const ‘utf8_nextstep’ is invalid in C++ [-Wc++-compat]
byte_t.c:72:24: error: array size missing in ‘utf8_viscii’
byte_t.c:72:24: warning: uninitialized const ‘utf8_viscii’ is invalid in C++ [-Wc++-compat]
byte_t.c:867:24: error: conflicting types for ‘utf8_AdobeStandardEncoding’
byte_t.c:984:24: error: conflicting types for ‘utf8_MacArabic’
byte_t.c:1134:24: error: conflicting types for ‘utf8_MacCentralEurRoman’
byte_t.c:1309:24: error: conflicting types for ‘utf8_MacCroatian’
byte_t.c:1439:24: error: conflicting types for ‘utf8_MacCyrillic’
byte_t.c:1556:24: error: conflicting types for ‘utf8_MacFarsi’
byte_t.c:1679:24: error: conflicting types for ‘utf8_MacGreek’
byte_t.c:1788:24: error: conflicting types for ‘utf8_MacHebrew’
byte_t.c:1952:24: error: conflicting types for ‘utf8_MacIcelandic’
byte_t.c:2133:24: error: conflicting types for ‘utf8_MacRoman’
byte_t.c:2319:24: error: conflicting types for ‘utf8_MacRomanian’
byte_t.c:2496:24: error: conflicting types for ‘utf8_MacRumanian’
byte_t.c:2659:24: error: conflicting types for ‘utf8_MacSami’
byte_t.c:2745:24: error: conflicting types for ‘utf8_MacThai’
byte_t.c:2910:24: error: conflicting types for ‘utf8_MacTurkish’
byte_t.c:3049:24: error: conflicting types for ‘utf8_cp1006’
byte_t.c:3167:24: error: conflicting types for ‘utf8_cp1250’
byte_t.c:3255:24: error: conflicting types for ‘utf8_cp1251’
byte_t.c:3343:24: error: conflicting types for ‘utf8_cp1252’
byte_t.c:3431:24: error: conflicting types for ‘utf8_cp1253’
byte_t.c:3527:24: error: conflicting types for ‘utf8_cp1254’
byte_t.c:3629:24: error: conflicting types for ‘utf8_cp1255’
byte_t.c:3763:24: error: conflicting types for ‘utf8_cp1256’
byte_t.c:3880:24: error: conflicting types for ‘utf8_cp1257’
byte_t.c:3994:24: error: conflicting types for ‘utf8_cp1258’
byte_t.c:4099:24: error: conflicting types for ‘utf8_cp424’
byte_t.c:4255:24: error: conflicting types for ‘utf8_cp437’
byte_t.c:4367:24: error: conflicting types for ‘utf8_cp737’
byte_t.c:4517:24: error: conflicting types for ‘utf8_cp775’
byte_t.c:4619:24: error: conflicting types for ‘utf8_cp850’
byte_t.c:4759:24: error: conflicting types for ‘utf8_cp852’
byte_t.c:4865:24: error: conflicting types for ‘utf8_cp855’
byte_t.c:4969:24: error: conflicting types for ‘utf8_cp856’
byte_t.c:5070:24: error: conflicting types for ‘utf8_cp857’
byte_t.c:5175:24: error: conflicting types for ‘utf8_cp858’
byte_t.c:5324:24: error: conflicting types for ‘utf8_cp860’
byte_t.c:5486:24: error: conflicting types for ‘utf8_cp861’
byte_t.c:5646:24: error: conflicting types for ‘utf8_cp862’
byte_t.c:5806:24: error: conflicting types for ‘utf8_cp863’
byte_t.c:5999:24: error: conflicting types for ‘utf8_cp864’
byte_t.c:6161:24: error: conflicting types for ‘utf8_cp865’
byte_t.c:6260:24: error: conflicting types for ‘utf8_cp866’
byte_t.c:6372:24: error: conflicting types for ‘utf8_cp869’
byte_t.c:6434:24: error: conflicting types for ‘utf8_cp874’
byte_t.c:6511:24: error: conflicting types for ‘utf8_hp_roman8’
byte_t.c:6592:24: error: conflicting types for ‘utf8_iso_8859_2’
byte_t.c:6663:24: error: conflicting types for ‘utf8_iso_8859_3’
byte_t.c:6738:24: error: conflicting types for ‘utf8_iso_8859_4’
byte_t.c:6785:24: error: conflicting types for ‘utf8_iso_8859_5’
byte_t.c:6826:24: error: conflicting types for ‘utf8_iso_8859_6’
byte_t.c:6896:24: error: conflicting types for ‘utf8_iso_8859_7’
byte_t.c:6946:24: error: conflicting types for ‘utf8_iso_8859_8’
byte_t.c:6985:24: error: conflicting types for ‘utf8_iso_8859_9’
byte_t.c:7062:24: error: conflicting types for ‘utf8_iso_8859_10’
byte_t.c:7102:24: error: conflicting types for ‘utf8_iso_8859_11’
byte_t.c:7186:24: error: conflicting types for ‘utf8_iso_8859_13’
byte_t.c:7284:24: error: conflicting types for ‘utf8_iso_8859_14’
byte_t.c:7335:24: error: conflicting types for ‘utf8_iso_8859_15’
byte_t.c:7421:24: error: conflicting types for ‘utf8_iso_8859_16’
byte_t.c:7517:24: error: conflicting types for ‘utf8_koi8_f’
byte_t.c:7623:24: error: conflicting types for ‘utf8_koi8_r’
byte_t.c:7758:24: error: conflicting types for ‘utf8_koi8_u’
byte_t.c:7862:24: error: conflicting types for ‘utf8_nextstep’
byte_t.c:7980:24: error: conflicting types for ‘utf8_viscii’
Fcntl.xs: In function ‘XS_Fcntl_S_ISREG’:
const-c.inc: In function ‘constant_add_symbol’:
./const-xs.inc: In function ‘XS_Fcntl_AUTOLOAD’:
./const-xs.inc:559:6: warning: format ‘%p’ expects argument of type ‘void *’, but argument 2 has type ‘struct SV *’ [-Wformat=]
./const-xs.inc:559:6: warning: format ‘%d’ expects argument of type ‘int’, but argument 4 has type ‘line_t’ [-Wformat=]
./const-xs.inc:564:6: warning: format ‘%p’ expects argument of type ‘void *’, but argument 2 has type ‘struct SV *’ [-Wformat=]
./const-xs.inc:564:6: warning: format ‘%d’ expects argument of type ‘int’, but argument 4 has type ‘line_t’ [-Wformat=]
Fcntl.xs: In function ‘XS_Fcntl_S_IMODE’:
Fcntl.xs: In function ‘XS_Fcntl_S_IFMT’:
./const-xs.inc: In function ‘boot_Fcntl’:
./const-xs.inc:517:11: warning: declaration of ‘cv’ shadows a parameter [-Wshadow]
Fcntl.xs:89:13: warning: declaration of ‘cv’ shadows a parameter [-Wshadow]
Encode.xs:31:15: warning: no previous prototype for ‘_encoded_utf8_to_bytes’ [-Wmissing-prototypes]
Encode.xs:32:15: warning: no previous prototype for ‘_encoded_bytes_to_utf8’ [-Wmissing-prototypes]
Encode.xs:46:1: warning: no previous prototype for ‘Encode_XSEncoding’ [-Wmissing-prototypes]
Encode.xs: In function ‘Encode_XSEncoding’:
Encode.xs:70:1: warning: no previous prototype for ‘call_failure’ [-Wmissing-prototypes]
Encode.xs: In function ‘do_fallback_cb’:
Encode.xs: In function ‘encode_method’:
Encode.xs: In function ‘strict_utf8’:
Encode.xs: In function ‘process_utf8’:
Encode.xs: In function ‘XS_Encode__utf8_decode_xs’:
../../pp.h:69:19: warning: declaration of ‘sp’ shadows a previous local [-Wshadow]
../../pp.h:69:19: warning: shadowed declaration is here [-Wshadow]
Encode.xs: In function ‘XS_Encode__utf8_encode_xs’:
Encode.xs: In function ‘XS_Encode__XS_renew’:
Encode.c: In function ‘XS_Encode__XS_renewed’:
Encode.xs: In function ‘XS_Encode__XS_name’:
Encode.xs: In function ‘XS_Encode__XS_cat_decode’:
Encode.xs: In function ‘XS_Encode__XS_decode’:
Encode.xs: In function ‘XS_Encode__XS_encode’:
Encode.xs: In function ‘XS_Encode__XS_needs_lines’:
Encode.xs: In function ‘XS_Encode__XS_perlio_ok’:
Encode.xs: In function ‘XS_Encode__XS_mime_name’:
Encode.xs: In function ‘XS_Encode__bytes_to_utf8’:
Encode.xs: In function ‘XS_Encode__utf8_to_bytes’:
Encode.c: In function ‘XS_Encode_is_utf8’:
Encode.c: In function ‘XS_Encode__utf8_on’:
Encode.c: In function ‘XS_Encode__utf8_off’:
Encode.c: In function ‘XS_Encode_DIE_ON_ERR’:
Encode.c: In function ‘XS_Encode_WARN_ON_ERR’:
Encode.c: In function ‘XS_Encode_LEAVE_SRC’:
Encode.c: In function ‘XS_Encode_RETURN_ON_ERR’:
Encode.c: In function ‘XS_Encode_PERLQQ’:
Encode.c: In function ‘XS_Encode_HTMLCREF’:
Encode.c: In function ‘XS_Encode_XMLCREF’:
Encode.c: In function ‘XS_Encode_STOP_AT_PARTIAL’:
Encode.c: In function ‘XS_Encode_FB_DEFAULT’:
Encode.c: In function ‘XS_Encode_FB_CROAK’:
Encode.c: In function ‘XS_Encode_FB_QUIET’:
Encode.c: In function ‘XS_Encode_FB_WARN’:
Encode.c: In function ‘XS_Encode_FB_PERLQQ’:
Encode.c: In function ‘XS_Encode_FB_HTMLCREF’:
Encode.c: In function ‘XS_Encode_FB_XMLCREF’:
DosGlob.xs: In function ‘glob_ophook’:
DosGlob.c: In function ‘XS_File__DosGlob__callsite’:
DosGlob.xs: In function ‘boot_File__DosGlob’:
def_t.c:9:24: error: array size missing in ‘utf8_iso_8859_1’
def_t.c:9:24: warning: uninitialized const ‘utf8_iso_8859_1’ is invalid in C++ [-Wc++-compat]
def_t.c:73:24: error: conflicting types for ‘utf8_iso_8859_1’
bsd_glob.c: In function ‘globtilde’:
bsd_glob.c:469:7: warning: "DOSISH" is not defined [-Wundef]
Call.xs: In function ‘filter_call’:
Call.c: In function ‘XS_Filter__Util__Call_filter_read’:
Call.c: In function ‘XS_Filter__Util__Call_real_import’:
Call.c: In function ‘XS_Filter__Util__Call_filter_del’:
Call.c: In function ‘XS_Filter__Util__Call_unimport’:
Call.xs: In function ‘boot_Filter__Util__Call’:
Call.xs:267:37: warning: cast increases required alignment of target type [-Wcast-align]
Call.xs:267:48: warning: cast increases required alignment of target type [-Wcast-align]
Glob.xs: In function ‘doglob’:
Glob.xs: In function ‘iterate’:
Glob.xs: In function ‘csh_glob’:
Glob.xs: In function ‘doglob_iter_wrapper’:
Glob.xs: In function ‘glob_ophook’:
Glob.c: In function ‘XS_File__Glob_GLOB_ERROR’:
Glob.xs: In function ‘XS_File__Glob_bsd_glob’:
Glob.xs: In function ‘XS_File__Glob_csh_glob’:
Glob.xs: In function ‘XS_File__Glob_bsd_glob_override’:
Glob.xs: In function ‘XS_File__Glob_CLONE’:
./const-xs.inc: In function ‘XS_File__Glob_AUTOLOAD’:
./const-xs.inc:135:6: warning: format ‘%p’ expects argument of type ‘void *’, but argument 2 has type ‘struct SV *’ [-Wformat=]
./const-xs.inc:135:6: warning: format ‘%d’ expects argument of type ‘int’, but argument 4 has type ‘line_t’ [-Wformat=]
./const-xs.inc:140:6: warning: format ‘%p’ expects argument of type ‘void *’, but argument 2 has type ‘struct SV *’ [-Wformat=]
./const-xs.inc:140:6: warning: format ‘%d’ expects argument of type ‘int’, but argument 4 has type ‘line_t’ [-Wformat=]
Glob.xs: In function ‘boot_File__Glob’:
./const-xs.inc:93:11: warning: declaration of ‘cv’ shadows a parameter [-Wshadow]
B.xs: In function ‘XS_B__OP_next’:
B.xs: In function ‘XS_B__IV_IVX’:
B.xs: In function ‘XS_B__MAGIC_MOREMAGIC’:
B.xs: In function ‘XS_B__GV_SV’:
B.xs: In function ‘XS_B__HV_ARRAY’:
B.xs: In function ‘XS_B__HE_VAL’:
B.xs: In function ‘XS_B__PADNAME_TYPE’:
DB_File.xs: In function ‘boot_DB_File’:
Peek.xs: In function ‘XS_Devel__Peek_DumpArray’:
RealPPPort.xs: In function ‘XS_Devel__PPPort_TestSvSTASH_set’:
../../../hv_func.h: In function ‘S_perl_hash_superfast’:
../../../hv_func.h:272:18: warning: cast increases required alignment of target type [-Wcast-align]
../../../hv_func.h: In function ‘S_perl_hash_murmur3’:
../../../hv_func.h:376:16: warning: cast increases required alignment of target type [-Wcast-align]
../../../hv_func.h:121:31: warning: cast increases required alignment of target type [-Wcast-align]
../../../hv_func.h: In function ‘S_perl_hash_djb2’:
../../../hv_func.h:470:18: warning: cast increases required alignment of target type [-Wcast-align]
../../../hv_func.h: In function ‘S_perl_hash_sdbm’:
../../../hv_func.h:480:18: warning: cast increases required alignment of target type [-Wcast-align]
../../../hv_func.h: In function ‘S_perl_hash_one_at_a_time’:
../../../hv_func.h:506:18: warning: cast increases required alignment of target type [-Wcast-align]
../../../hv_func.h: In function ‘S_perl_hash_one_at_a_time_hard’:
../../../hv_func.h:521:18: warning: cast increases required alignment of target type [-Wcast-align]
../../../hv_func.h: In function ‘S_perl_hash_old_one_at_a_time’:
../../../hv_func.h:556:18: warning: cast increases required alignment of target type [-Wcast-align]
GDBM_File.xs:30:6: warning: "GDBM_VERSION_MAJOR" is not defined [-Wundef]
GDBM_File.xs:33:1: warning: function declaration isn’t a prototype [-Wstrict-prototypes]
./const-xs.inc: In function ‘XS_GDBM_File_AUTOLOAD’:
./const-xs.inc:137:6: warning: format ‘%d’ expects argument of type ‘int’, but argument 4 has type ‘line_t’ [-Wformat=]
./const-xs.inc:142:6: warning: format ‘%d’ expects argument of type ‘int’, but argument 4 has type ‘line_t’ [-Wformat=]
GDBM_File.c: In function ‘boot_GDBM_File’:
GDBM_File.c:789:14: warning: declaration of ‘cv’ shadows a parameter [-Wshadow]
./const-xs.inc:95:11: warning: declaration of ‘cv’ shadows a parameter [-Wshadow]
Util.xs: In function ‘XS_Hash__Util_bucket_array’:
FieldHash.xs:23:1: warning: no previous prototype for ‘HUF_get_ob_reg’ [-Wmissing-prototypes]
FieldHash.xs:51:1: warning: no previous prototype for ‘HUF_global’ [-Wmissing-prototypes]
FieldHash.xs: In function ‘HUF_global’:
FieldHash.xs:70:1: warning: no previous prototype for ‘HUF_obj_id’ [-Wmissing-prototypes]
FieldHash.xs:98:1: warning: no previous prototype for ‘HUF_add_uvar_magic’ [-Wmissing-prototypes]
FieldHash.xs:115:1: warning: no previous prototype for ‘HUF_get_trigger_content’ [-Wmissing-prototypes]
FieldHash.xs:126:5: warning: no previous prototype for ‘HUF_destroy_obj’ [-Wmissing-prototypes]
FieldHash.xs:159:1: warning: no previous prototype for ‘HUF_new_trigger’ [-Wmissing-prototypes]
FieldHash.xs:173:1: warning: no previous prototype for ‘HUF_ask_trigger’ [-Wmissing-prototypes]
FieldHash.xs:183:1: warning: no previous prototype for ‘HUF_get_trigger0’ [-Wmissing-prototypes]
FieldHash.xs:191:1: warning: no previous prototype for ‘HUF_get_trigger’ [-Wmissing-prototypes]
FieldHash.xs:202:1: warning: no previous prototype for ‘HUF_mark_field’ [-Wmissing-prototypes]
FieldHash.xs:216:5: warning: no previous prototype for ‘HUF_watch_key_safe’ [-Wmissing-prototypes]
FieldHash.xs:239:5: warning: no previous prototype for ‘HUF_watch_key_id’ [-Wmissing-prototypes]
FieldHash.xs:252:5: warning: no previous prototype for ‘HUF_func_2mode’ [-Wmissing-prototypes]
FieldHash.xs:261:7: warning: no previous prototype for ‘HUF_mode_2func’ [-Wmissing-prototypes]
FieldHash.xs:276:1: warning: no previous prototype for ‘HUF_get_status’ [-Wmissing-prototypes]
FieldHash.xs: In function ‘HUF_get_status’:
FieldHash.xs:282:19: warning: cast increases required alignment of target type [-Wcast-align]
FieldHash.xs:295:1: warning: no previous prototype for ‘HUF_fix_trigger’ [-Wmissing-prototypes]
FieldHash.xs:322:1: warning: no previous prototype for ‘HUF_fix_objects’ [-Wmissing-prototypes]
FieldHash.xs:356:5: warning: no previous prototype for ‘HUF_inc_var’ [-Wmissing-prototypes]
FieldHash.c: In function ‘boot_Hash__Util__FieldHash’:
FieldHash.c:753:14: warning: declaration of ‘cv’ shadows a parameter [-Wshadow]
./const-xs.inc: In function ‘XS_I18N__Langinfo_AUTOLOAD’:
./const-xs.inc:263:6: warning: format ‘%d’ expects argument of type ‘int’, but argument 4 has type ‘line_t’ [-Wformat=]
./const-xs.inc:268:6: warning: format ‘%d’ expects argument of type ‘int’, but argument 4 has type ‘line_t’ [-Wformat=]
./const-xs.inc: In function ‘boot_I18N__Langinfo’:
./const-xs.inc:221:11: warning: declaration of ‘cv’ shadows a parameter [-Wshadow]
IO.xs: In function ‘XS_IO__Poll__poll’:
IO.xs:322:26: warning: cast increases required alignment of target type [-Wcast-align]
IO.xs: In function ‘XS_IO__Handle__create_getline_subs’:
SysV.xs: In function ‘sv2addr’:
SysV.xs:93:14: warning: cast increases required alignment of target type [-Wcast-align]
SysV.xs: In function ‘XS_IPC__Msg__stat_unpack’:
SysV.xs:161:35: warning: cast increases required alignment of target type [-Wcast-align]
SysV.xs: In function ‘XS_IPC__Semaphore__stat_unpack’:
SysV.xs:220:35: warning: cast increases required alignment of target type [-Wcast-align]
SysV.xs: In function ‘XS_IPC__SharedMem__stat_unpack’:
SysV.xs:279:35: warning: cast increases required alignment of target type [-Wcast-align]
ListUtil.xs: In function ‘XS_List__Util_min’:
ListUtil.xs: In function ‘XS_List__Util_reduce’:
ListUtil.xs:311:9: warning: declaration of ‘cv’ shadows a parameter [-Wshadow]
../../cop.h:1214:13: warning: declaration of ‘cv’ shadows a previous local [-Wshadow]
ListUtil.xs:311:9: warning: shadowed declaration is here [-Wshadow]
../../cop.h:1198:10: warning: variable ‘newsp’ set but not used [-Wunused-but-set-variable]
ListUtil.xs: In function ‘XS_List__Util_first’:
ListUtil.xs:370:9: warning: declaration of ‘cv’ shadows a parameter [-Wshadow]
ListUtil.xs:370:9: warning: shadowed declaration is here [-Wshadow]
ListUtil.xs: In function ‘XS_List__Util_any’:
ListUtil.xs:439:9: warning: declaration of ‘cv’ shadows a parameter [-Wshadow]
ListUtil.xs:439:9: warning: shadowed declaration is here [-Wshadow]
ListUtil.xs: In function ‘XS_List__Util_pairfirst’:
ListUtil.xs:493:9: warning: declaration of ‘cv’ shadows a parameter [-Wshadow]
ListUtil.xs:493:9: warning: shadowed declaration is here [-Wshadow]
ListUtil.xs: In function ‘XS_List__Util_pairgrep’:
ListUtil.xs:571:9: warning: declaration of ‘cv’ shadows a parameter [-Wshadow]
ListUtil.xs:571:9: warning: shadowed declaration is here [-Wshadow]
../../cop.h:1128:10: warning: declaration of ‘i’ shadows a previous local [-Wshadow]
ListUtil.xs:591:13: warning: shadowed declaration is here [-Wshadow]
../../cop.h:1154:10: warning: declaration of ‘i’ shadows a previous local [-Wshadow]
ListUtil.xs: In function ‘XS_List__Util_pairmap’:
ListUtil.xs:659:9: warning: declaration of ‘cv’ shadows a parameter [-Wshadow]
ListUtil.xs:680:13: warning: declaration of ‘ret_gimme’ shadows a previous local [-Wshadow]
ListUtil.xs:661:9: warning: shadowed declaration is here [-Wshadow]
ListUtil.xs:659:9: warning: shadowed declaration is here [-Wshadow]
ListUtil.xs:681:13: warning: shadowed declaration is here [-Wshadow]
ListUtil.xs:689:17: warning: unused variable ‘b’ [-Wunused-variable]
ListUtil.xs:688:17: warning: unused variable ‘a’ [-Wunused-variable]
ListUtil.xs:731:17: warning: unused variable ‘b’ [-Wunused-variable]
ListUtil.xs:730:17: warning: unused variable ‘a’ [-Wunused-variable]
ListUtil.xs: In function ‘XS_Sub__Util_set_prototype’:
ListUtil.xs:1131:9: warning: declaration of ‘cv’ shadows a parameter [-Wshadow]
ListUtil.xs: In function ‘XS_Sub__Util_set_subname’:
ListUtil.xs:1158:9: warning: declaration of ‘cv’ shadows a parameter [-Wshadow]
../../sv.h:1306:19: warning: cast increases required alignment of target type [-Wcast-align]
ListUtil.xs: In function ‘XS_Sub__Util_subname’:
ListUtil.xs:1267:9: warning: declaration of ‘cv’ shadows a parameter [-Wshadow]
Base64.xs: In function ‘XS_MIME__QuotedPrint_encode_qp’:
mro.xs: In function ‘S_mro_get_linear_isa_c3’:
mro.xs: In function ‘XS_mro__nextcan’:
NDBM_File.c: In function ‘boot_NDBM_File’:
NDBM_File.c:627:14: warning: declaration of ‘cv’ shadows a parameter [-Wshadow]
ODBM_File.c: In function ‘XS_ODBM_File_STORE’:
ODBM_File.c:381:6: warning: variable ‘flags’ set but not used [-Wunused-but-set-variable]
ODBM_File.c: In function ‘XS_ODBM_File_DELETE’:
ODBM_File.xs:60:31: warning: identifier ‘delete’ conflicts with C++ keyword [-Wc++-compat]
ODBM_File.c: In function ‘boot_ODBM_File’:
ODBM_File.c:623:14: warning: declaration of ‘cv’ shadows a parameter [-Wshadow]
Opcode.xs: In function ‘opmask_addlocal’:
../../perl.h:6284:12: warning: unused variable ‘my_cxtp’ [-Wunused-variable]
Opcode.xs: In function ‘XS_Opcode_opdesc’:
Opcode.xs:470:12: warning: cast increases required alignment of target type [-Wcast-align]
encoding.xs:53:1: warning: no previous prototype for ‘PerlIOEncode_getarg’ [-Wmissing-prototypes]
encoding.xs: In function ‘PerlIOEncode_getarg’:
../../perliol.h:104:29: warning: cast increases required alignment of target type [-Wcast-align]
encoding.xs:81:1: warning: no previous prototype for ‘PerlIOEncode_pushed’ [-Wmissing-prototypes]
encoding.xs: In function ‘PerlIOEncode_pushed’:
encoding.xs:158:1: warning: no previous prototype for ‘PerlIOEncode_popped’ [-Wmissing-prototypes]
encoding.xs: In function ‘PerlIOEncode_popped’:
encoding.xs:181:1: warning: no previous prototype for ‘PerlIOEncode_get_base’ [-Wmissing-prototypes]
encoding.xs: In function ‘PerlIOEncode_get_base’:
encoding.xs:218:1: warning: no previous prototype for ‘PerlIOEncode_fill’ [-Wmissing-prototypes]
encoding.xs: In function ‘PerlIOEncode_fill’:
encoding.xs:400:1: warning: no previous prototype for ‘PerlIOEncode_flush’ [-Wmissing-prototypes]
encoding.xs: In function ‘PerlIOEncode_flush’:
encoding.xs:517:1: warning: no previous prototype for ‘PerlIOEncode_close’ [-Wmissing-prototypes]
encoding.xs: In function ‘PerlIOEncode_close’:
encoding.xs:546:1: warning: no previous prototype for ‘PerlIOEncode_tell’ [-Wmissing-prototypes]
encoding.xs: In function ‘PerlIOEncode_tell’:
encoding.xs:560:1: warning: no previous prototype for ‘PerlIOEncode_dup’ [-Wmissing-prototypes]
encoding.xs: In function ‘PerlIOEncode_dup’:
encoding.xs:574:1: warning: no previous prototype for ‘PerlIOEncode_write’ [-Wmissing-prototypes]
encoding.xs: In function ‘PerlIOEncode_write’:
encoding.xs: In function ‘boot_PerlIO__encoding’:
mmap.xs:27:1: warning: no previous prototype for ‘PerlIOMmap_map’ [-Wmissing-prototypes]
mmap.xs: In function ‘PerlIOMmap_map’:
mmap.xs:92:1: warning: no previous prototype for ‘PerlIOMmap_unmap’ [-Wmissing-prototypes]
mmap.xs: In function ‘PerlIOMmap_unmap’:
mmap.xs:120:1: warning: no previous prototype for ‘PerlIOMmap_get_base’ [-Wmissing-prototypes]
mmap.xs: In function ‘PerlIOMmap_get_base’:
mmap.xs:153:1: warning: no previous prototype for ‘PerlIOMmap_unread’ [-Wmissing-prototypes]
mmap.xs: In function ‘PerlIOMmap_unread’:
mmap.xs:184:1: warning: no previous prototype for ‘PerlIOMmap_write’ [-Wmissing-prototypes]
mmap.xs: In function ‘PerlIOMmap_write’:
mmap.xs:211:1: warning: no previous prototype for ‘PerlIOMmap_flush’ [-Wmissing-prototypes]
mmap.xs: In function ‘PerlIOMmap_flush’:
mmap.xs:239:1: warning: no previous prototype for ‘PerlIOMmap_fill’ [-Wmissing-prototypes]
mmap.xs: In function ‘PerlIOMmap_fill’:
mmap.xs:253:1: warning: no previous prototype for ‘PerlIOMmap_close’ [-Wmissing-prototypes]
mmap.xs: In function ‘PerlIOMmap_close’:
mmap.xs:269:1: warning: no previous prototype for ‘PerlIOMmap_dup’ [-Wmissing-prototypes]
scalar.xs:19:1: warning: no previous prototype for ‘PerlIOScalar_pushed’ [-Wmissing-prototypes]
scalar.xs: In function ‘PerlIOScalar_pushed’:
scalar.xs:77:1: warning: no previous prototype for ‘PerlIOScalar_popped’ [-Wmissing-prototypes]
scalar.xs: In function ‘PerlIOScalar_popped’:
scalar.xs:88:1: warning: no previous prototype for ‘PerlIOScalar_close’ [-Wmissing-prototypes]
scalar.xs:96:1: warning: no previous prototype for ‘PerlIOScalar_fileno’ [-Wmissing-prototypes]
scalar.xs:103:1: warning: no previous prototype for ‘PerlIOScalar_seek’ [-Wmissing-prototypes]
scalar.xs: In function ‘PerlIOScalar_seek’:
scalar.xs:137:1: warning: no previous prototype for ‘PerlIOScalar_tell’ [-Wmissing-prototypes]
scalar.xs: In function ‘PerlIOScalar_tell’:
scalar.xs:145:1: warning: no previous prototype for ‘PerlIOScalar_read’ [-Wmissing-prototypes]
scalar.xs: In function ‘PerlIOScalar_read’:
scalar.xs:178:27: warning: comparison is always true due to limited range of data type [-Wtype-limits]
scalar.xs:191:1: warning: no previous prototype for ‘PerlIOScalar_write’ [-Wmissing-prototypes]
scalar.xs: In function ‘PerlIOScalar_write’:
scalar.xs:254:1: warning: no previous prototype for ‘PerlIOScalar_fill’ [-Wmissing-prototypes]
scalar.xs:261:1: warning: no previous prototype for ‘PerlIOScalar_flush’ [-Wmissing-prototypes]
scalar.xs:268:1: warning: no previous prototype for ‘PerlIOScalar_get_base’ [-Wmissing-prototypes]
scalar.xs: In function ‘PerlIOScalar_get_base’:
scalar.xs:279:1: warning: no previous prototype for ‘PerlIOScalar_get_ptr’ [-Wmissing-prototypes]
scalar.xs: In function ‘PerlIOScalar_get_ptr’:
scalar.xs:289:1: warning: no previous prototype for ‘PerlIOScalar_get_cnt’ [-Wmissing-prototypes]
scalar.xs: In function ‘PerlIOScalar_get_cnt’:
scalar.xs:304:1: warning: no previous prototype for ‘PerlIOScalar_bufsiz’ [-Wmissing-prototypes]
scalar.xs: In function ‘PerlIOScalar_bufsiz’:
scalar.xs:315:1: warning: no previous prototype for ‘PerlIOScalar_set_ptrcnt’ [-Wmissing-prototypes]
scalar.xs: In function ‘PerlIOScalar_set_ptrcnt’:
scalar.xs:325:1: warning: no previous prototype for ‘PerlIOScalar_open’ [-Wmissing-prototypes]
scalar.xs:346:1: warning: no previous prototype for ‘PerlIOScalar_arg’ [-Wmissing-prototypes]
scalar.xs: In function ‘PerlIOScalar_arg’:
scalar.xs:363:1: warning: no previous prototype for ‘PerlIOScalar_dup’ [-Wmissing-prototypes]
scalar.xs: In function ‘PerlIOScalar_dup’:
via.xs:44:1: warning: no previous prototype for ‘PerlIOVia_fetchmethod’ [-Wmissing-prototypes]
via.xs:67:1: warning: no previous prototype for ‘PerlIOVia_method’ [-Wmissing-prototypes]
via.xs: In function ‘PerlIOVia_method’:
via.xs:130:1: warning: no previous prototype for ‘PerlIOVia_pushed’ [-Wmissing-prototypes]
via.xs: In function ‘PerlIOVia_pushed’:
via.xs:213:1: warning: no previous prototype for ‘PerlIOVia_open’ [-Wmissing-prototypes]
via.xs: In function ‘PerlIOVia_open’:
via.xs:308:1: warning: no previous prototype for ‘PerlIOVia_popped’ [-Wmissing-prototypes]
via.xs:334:1: warning: no previous prototype for ‘PerlIOVia_close’ [-Wmissing-prototypes]
via.xs:347:1: warning: no previous prototype for ‘PerlIOVia_fileno’ [-Wmissing-prototypes]
via.xs:356:1: warning: no previous prototype for ‘PerlIOVia_binmode’ [-Wmissing-prototypes]
via.xs:369:1: warning: no previous prototype for ‘PerlIOVia_seek’ [-Wmissing-prototypes]
via.xs:389:1: warning: no previous prototype for ‘PerlIOVia_tell’ [-Wmissing-prototypes]
via.xs:400:1: warning: no previous prototype for ‘PerlIOVia_unread’ [-Wmissing-prototypes]
via.xs:414:1: warning: no previous prototype for ‘PerlIOVia_read’ [-Wmissing-prototypes]
via.xs:439:1: warning: no previous prototype for ‘PerlIOVia_write’ [-Wmissing-prototypes]
via.xs:456:1: warning: no previous prototype for ‘PerlIOVia_fill’ [-Wmissing-prototypes]
via.xs:480:1: warning: no previous prototype for ‘PerlIOVia_flush’ [-Wmissing-prototypes]
via.xs:493:1: warning: no previous prototype for ‘PerlIOVia_get_base’ [-Wmissing-prototypes]
via.xs:505:1: warning: no previous prototype for ‘PerlIOVia_get_ptr’ [-Wmissing-prototypes]
via.xs:518:1: warning: no previous prototype for ‘PerlIOVia_get_cnt’ [-Wmissing-prototypes]
via.xs:530:1: warning: no previous prototype for ‘PerlIOVia_bufsiz’ [-Wmissing-prototypes]
via.xs:541:1: warning: no previous prototype for ‘PerlIOVia_set_ptrcnt’ [-Wmissing-prototypes]
via.xs:549:1: warning: no previous prototype for ‘PerlIOVia_setlinebuf’ [-Wmissing-prototypes]
via.xs:557:1: warning: no previous prototype for ‘PerlIOVia_clearerr’ [-Wmissing-prototypes]
via.xs:565:1: warning: no previous prototype for ‘PerlIOVia_error’ [-Wmissing-prototypes]
via.xs:574:1: warning: no previous prototype for ‘PerlIOVia_eof’ [-Wmissing-prototypes]
via.xs:583:1: warning: no previous prototype for ‘PerlIOVia_getarg’ [-Wmissing-prototypes]
via.xs:592:1: warning: no previous prototype for ‘PerlIOVia_dup’ [-Wmissing-prototypes]
re_exec.c: In function ‘my_re_intuit_start’:
re_exec.c:713:17: warning: declaration of ‘sv’ shadows a parameter [-Wshadow]
re_exec.c:621:25: warning: shadowed declaration is here [-Wshadow]
re_exec.c: In function ‘S_find_byclass’:
../../regcomp.h:571:28: warning: cast increases required alignment of target type [-Wcast-align]
POSIX.xs:978:12: warning: function declaration isn’t a prototype [-Wstrict-prototypes]
../../regcomp.h:345:22: warning: cast increases required alignment of target type [-Wcast-align]
re_exec.c:2442:20: warning: cast increases required alignment of target type [-Wcast-align]
POSIX.xs: In function ‘restore_sigmask’:
POSIX.xs:1485:25: warning: cast increases required alignment of target type [-Wcast-align]
re_exec.c:2555:33: warning: declaration of ‘tmp’ shadows a previous local [-Wshadow]
re_exec.c:1817:9: warning: shadowed declaration is here [-Wshadow]
POSIX.c: In function ‘XS_POSIX__SigSet_addset’:
POSIX.c:1859:15: warning: cast increases required alignment of target type [-Wcast-align]
POSIX.c: In function ‘XS_POSIX__SigSet_emptyset’:
POSIX.c:1897:15: warning: cast increases required alignment of target type [-Wcast-align]
POSIX.c: In function ‘XS_POSIX__SigSet_ismember’:
POSIX.c:1937:15: warning: cast increases required alignment of target type [-Wcast-align]
POSIX.c: In function ‘XS_POSIX__Termios_getattr’:
POSIX.c:1999:20: warning: cast increases required alignment of target type [-Wcast-align]
POSIX.c: In function ‘XS_POSIX__Termios_setattr’:
POSIX.c:2050:20: warning: cast increases required alignment of target type [-Wcast-align]
POSIX.c: In function ‘XS_POSIX__Termios_getispeed’:
POSIX.c:2107:20: warning: cast increases required alignment of target type [-Wcast-align]
re_exec.c: In function ‘S_reg_check_named_buff_matched’:
re_exec.c:3861:15: warning: cast increases required alignment of target type [-Wcast-align]
POSIX.c: In function ‘XS_POSIX__Termios_getiflag’:
POSIX.c:2136:20: warning: cast increases required alignment of target type [-Wcast-align]
POSIX.c: In function ‘XS_POSIX__Termios_getcc’:
POSIX.c:2186:20: warning: cast increases required alignment of target type [-Wcast-align]
POSIX.c: In function ‘XS_POSIX__Termios_setispeed’:
POSIX.c:2223:20: warning: cast increases required alignment of target type [-Wcast-align]
POSIX.c: In function ‘XS_POSIX__Termios_setiflag’:
POSIX.c:2263:20: warning: cast increases required alignment of target type [-Wcast-align]
re_exec.c: In function ‘S_regmatch’:
POSIX.c: In function ‘XS_POSIX__Termios_setcc’:
POSIX.c:2309:20: warning: cast increases required alignment of target type [-Wcast-align]
./const-xs.inc: In function ‘XS_POSIX_constant’:
./const-xs.inc:1461:6: warning: format ‘%d’ expects argument of type ‘int’, but argument 4 has type ‘line_t’ [-Wformat=]
./const-xs.inc:1466:6: warning: format ‘%d’ expects argument of type ‘int’, but argument 4 has type ‘line_t’ [-Wformat=]
POSIX.xs: In function ‘XS_POSIX_localeconv’:
POSIX.xs:2031:25: warning: cast increases required alignment of target type [-Wcast-align]
re_exec.c:5579:37: warning: comparison between signed and unsigned integer expressions [-Wsign-compare]
re_exec.c:5616:37: warning: comparison between signed and unsigned integer expressions [-Wsign-compare]
re_exec.c:5642:42: warning: comparison between signed and unsigned integer expressions [-Wsign-compare]
re_exec.c:5711:42: warning: comparison between signed and unsigned integer expressions [-Wsign-compare]
re_exec.c:6148:22: warning: declaration of ‘startpoint’ shadows a previous local [-Wshadow]
re_exec.c:4852:11: warning: shadowed declaration is here [-Wshadow]
../../regcomp.h:348:24: warning: cast increases required alignment of target type [-Wcast-align]
../../cop.h:1126:11: warning: declaration of ‘next’ shadows a previous local [-Wshadow]
re_exec.c:4829:14: warning: shadowed declaration is here [-Wshadow]
POSIX.xs: In function ‘XS_POSIX_sigaction’:
POSIX.xs:2890:16: warning: cast increases required alignment of target type [-Wcast-align]
re_exec.c:6744:10: warning: declaration of ‘n’ shadows a previous local [-Wshadow]
re_exec.c:4830:9: warning: shadowed declaration is here [-Wshadow]
POSIX.xs:2949:16: warning: cast increases required alignment of target type [-Wcast-align]
POSIX.c: In function ‘XS_POSIX_sigpending’:
POSIX.c:3692:15: warning: cast increases required alignment of target type [-Wcast-align]
POSIX.xs: In function ‘XS_POSIX_sigprocmask’:
POSIX.xs:3000:15: warning: cast increases required alignment of target type [-Wcast-align]
re_exec.c:7441:7: warning: declaration of ‘n’ shadows a previous local [-Wshadow]
POSIX.xs:3008:18: warning: cast increases required alignment of target type [-Wcast-align]
re_exec.c: In function ‘S_regrepeat’:
POSIX.c: In function ‘XS_POSIX_mbstowcs’:
POSIX.c:4177:16: warning: cast increases required alignment of target type [-Wcast-align]
POSIX.c: In function ‘XS_POSIX_mbtowc’:
POSIX.c:4200:18: warning: cast increases required alignment of target type [-Wcast-align]
re_exec.c: In function ‘S_reginclass’:
../../regcomp.h:549:8: warning: cast increases required alignment of target type [-Wcast-align]
POSIX.c: In function ‘XS_POSIX_wcstombs’:
POSIX.c:4225:19: warning: cast increases required alignment of target type [-Wcast-align]
../../regcomp.h:537:35: warning: cast increases required alignment of target type [-Wcast-align]
POSIX.xs: In function ‘XS_POSIX_strtod’:
POSIX.xs: In function ‘XS_POSIX_strtold’:
POSIX.xs: In function ‘boot_POSIX’:
POSIX.xs:1662:9: warning: declaration of ‘cv’ shadows a parameter [-Wshadow]
POSIX.xs:1663:17: warning: declaration of ‘file’ shadows a previous local [-Wshadow]
POSIX.c:5212:17: warning: shadowed declaration is here [-Wshadow]
./const-xs.inc:1232:11: warning: declaration of ‘cv’ shadows a parameter [-Wshadow]
POSIX.o: In function `XS_POSIX_tmpnam':
pair.c: In function ‘sdbm__fitpair’:
pair.c:53:15: warning: cast increases required alignment of target type [-Wcast-align]
pair.c: In function ‘sdbm__putpair’:
pair.c:69:15: warning: cast increases required alignment of target type [-Wcast-align]
pair.c: In function ‘sdbm__getpair’:
pair.c:96:15: warning: cast increases required alignment of target type [-Wcast-align]
pair.c: In function ‘sdbm__exipair’:
pair.c:112:15: warning: cast increases required alignment of target type [-Wcast-align]
pair.c: In function ‘sdbm__duppair’:
pair.c:124:15: warning: cast increases required alignment of target type [-Wcast-align]
pair.c: In function ‘sdbm__getnkey’:
pair.c:134:15: warning: cast increases required alignment of target type [-Wcast-align]
pair.c: In function ‘sdbm__delpair’:
pair.c:153:15: warning: cast increases required alignment of target type [-Wcast-align]
pair.c: In function ‘seepair’:
pair.c:225:15: warning: cast increases required alignment of target type [-Wcast-align]
pair.c: In function ‘sdbm__splpage’:
pair.c:245:15: warning: cast increases required alignment of target type [-Wcast-align]
pair.c: In function ‘sdbm__chkpage’:
pair.c:282:15: warning: cast increases required alignment of target type [-Wcast-align]
SDBM_File.c: In function ‘boot_SDBM_File’:
SDBM_File.c:609:14: warning: declaration of ‘cv’ shadows a parameter [-Wshadow]
Socket.xs: In function ‘xs_getnameinfo’:
Socket.xs:561:20: warning: cast increases required alignment of target type [-Wcast-align]
./const-xs.inc: In function ‘XS_Socket_AUTOLOAD’:
./const-xs.inc:911:6: warning: format ‘%d’ expects argument of type ‘int’, but argument 4 has type ‘line_t’ [-Wformat=]
./const-xs.inc:916:6: warning: format ‘%d’ expects argument of type ‘int’, but argument 4 has type ‘line_t’ [-Wformat=]
Socket.xs: In function ‘XS_Socket_sockaddr_family’:
Socket.xs:656:30: warning: cast increases required alignment of target type [-Wcast-align]
./const-xs.inc: In function ‘boot_Socket’:
./const-xs.inc:815:11: warning: declaration of ‘cv’ shadows a parameter [-Wshadow]
re_comp.c: In function ‘S_get_ANYOF_cp_list_for_ssc’:
re_comp.c: In function ‘S_make_trie’:
re_comp.c:2962:21: warning: declaration of ‘tmp’ shadows a previous local [-Wshadow]
re_comp.c:2951:34: warning: shadowed declaration is here [-Wshadow]
re_comp.c:2963:26: warning: declaration of ‘ch’ shadows a previous local [-Wshadow]
re_comp.c:2952:18: warning: shadowed declaration is here [-Wshadow]
re_comp.c:2983:28: warning: declaration of ‘len’ shadows a previous local [-Wshadow]
re_comp.c:2138:12: warning: shadowed declaration is here [-Wshadow]
re_comp.c:3080:37: warning: cast increases required alignment of target type [-Wcast-align]
re_comp.c: In function ‘S_construct_ahocorasick_from_trie’:
../../handy.h:2061:43: warning: cast increases required alignment of target type [-Wcast-align]
re_comp.c: In function ‘S_study_chunk’:
re_comp.c:4092:34: warning: declaration of ‘last’ shadows a parameter [-Wshadow]
re_comp.c:3763:13: warning: shadowed declaration is here [-Wshadow]
re_comp.c:5112:33: warning: cast increases required alignment of target type [-Wcast-align]
re_comp.c:5115:59: warning: cast increases required alignment of target type [-Wcast-align]
re_comp.c: In function ‘S_concat_pat’:
re_comp.c:5915:33: warning: declaration of ‘svp’ shadows a previous local [-Wshadow]
re_comp.c:5862:10: warning: shadowed declaration is here [-Wshadow]
re_comp.c:5963:17: warning: declaration of ‘sv’ shadows a previous local [-Wshadow]
re_comp.c:5876:13: warning: shadowed declaration is here [-Wshadow]
re_comp.c: In function ‘S_compile_runtime_code’:
../../cop.h:1128:26: warning: declaration of ‘p’ shadows a previous local [-Wshadow]
re_comp.c:6142:8: warning: shadowed declaration is here [-Wshadow]
../../cop.h:1154:27: warning: declaration of ‘p’ shadows a previous local [-Wshadow]
re_comp.c: In function ‘my_re_op_compile’:
re_comp.c:7370:28: warning: declaration of ‘scan’ shadows a previous local [-Wshadow]
re_comp.c:6398:14: warning: shadowed declaration is here [-Wshadow]
../../regcomp.h:956:40: warning: declaration of ‘re_debug_flags’ shadows a previous local [-Wshadow]
../../regcomp.h:956:40: warning: shadowed declaration is here [-Wshadow]
re_comp.c: In function ‘my_reg_named_buff_fetch’:
re_comp.c:7475:23: warning: cast increases required alignment of target type [-Wcast-align]
re_comp.c: In function ‘my_reg_named_buff_nextkey’:
re_comp.c:7555:25: warning: cast increases required alignment of target type [-Wcast-align]
re_comp.c: In function ‘my_reg_named_buff_scalar’:
re_comp.c: In function ‘my_reg_named_buff_all’:
re_comp.c:7617:25: warning: cast increases required alignment of target type [-Wcast-align]
re_comp.c: In function ‘S__invlist_array_init’:
re_comp.c:8016:21: warning: cast increases required alignment of target type [-Wcast-align]
re_comp.c: In function ‘S_reg’:
re_comp.c:7917:9: warning: declaration of ‘num’ shadows a previous local [-Wshadow]
re_comp.c:9778:9: warning: shadowed declaration is here [-Wshadow]
re_comp.c:9940:11: warning: declaration of ‘num’ shadows a previous local [-Wshadow]
re_comp.c:10024:39: warning: cast increases required alignment of target type [-Wcast-align]
re_comp.c:10033:38: warning: cast increases required alignment of target type [-Wcast-align]
re_comp.c:10108:29: warning: cast increases required alignment of target type [-Wcast-align]
re_comp.c:10302:18: warning: declaration of ‘num’ shadows a previous local [-Wshadow]
re_comp.c:10344:34: warning: cast increases required alignment of target type [-Wcast-align]
re_comp.c: In function ‘S_grok_bslash_N’:
re_comp.c:540:8: warning: declaration of ‘len’ shadows a previous local [-Wshadow]
re_comp.c:11259:9: warning: shadowed declaration is here [-Wshadow]
re_comp.c: In function ‘S_regatom’:
re_comp.c:12004:9: warning: declaration of ‘parse_start’ shadows a previous local [-Wshadow]
re_comp.c:11656:11: warning: shadowed declaration is here [-Wshadow]
re_comp.c:12184:20: warning: declaration of ‘parse_start’ shadows a previous local [-Wshadow]
re_comp.c:12246:13: warning: shadowed declaration is here [-Wshadow]
re_comp.c:12517:12: warning: declaration of ‘flags’ shadows a previous local [-Wshadow]
re_comp.c:11655:9: warning: shadowed declaration is here [-Wshadow]
re_comp.c:12555:12: warning: declaration of ‘len’ shadows a previous local [-Wshadow]
re_comp.c: In function ‘S_populate_ANYOF_from_invlist’:
../../regcomp.h:570:38: warning: cast increases required alignment of target type [-Wcast-align]
re_comp.c: In function ‘S_handle_regex_sets’:
re_comp.c:13343:12: warning: declaration of ‘depth’ shadows a parameter [-Wshadow]
re_comp.c:13300:37: warning: shadowed declaration is here [-Wshadow]
re_comp.c:13318:12: warning: shadowed declaration is here [-Wshadow]
re_comp.c:13560:34: warning: declaration of ‘save_parse’ shadows a previous local [-Wshadow]
re_comp.c:13322:22: warning: shadowed declaration is here [-Wshadow]
re_comp.c:13752:25: warning: declaration of ‘lhs’ shadows a previous local [-Wshadow]
re_comp.c:13538:17: warning: shadowed declaration is here [-Wshadow]
re_comp.c: In function ‘S_regclass’:
../../regcomp.h:540:46: warning: cast increases required alignment of target type [-Wcast-align]
../../regcomp.h:531:34: warning: cast increases required alignment of target type [-Wcast-align]
re_comp.c: In function ‘S_set_ANYOF_arg’:
re_comp.c: In function ‘S_reganode’:
re_comp.c: In function ‘S_reg2Lanode’:
re_comp.c: In function ‘S_regtail’:
re_comp.c: In function ‘S_regtail_study’:
re_comp.c: In function ‘my_regprop’:
re_comp.c:16963:27: warning: cast increases required alignment of target type [-Wcast-align]
re_comp.c: In function ‘my_regfree’:
re_comp.c: In function ‘S_dumpuntil’:
re_comp.c:18168:17: warning: declaration of ‘op’ shadows a previous local [-Wshadow]
re_comp.c:18100:8: warning: shadowed declaration is here [-Wshadow]
Storable.xs: In function ‘init_perinterp’:
Storable.xs:412:7: warning: cast increases required alignment of target type [-Wcast-align]
Storable.xs:394:8: warning: cast increases required alignment of target type [-Wcast-align]
Storable.xs: In function ‘allocate_context’:
Storable.xs: In function ‘free_context’:
Storable.xs:1663:18: warning: cast increases required alignment of target type [-Wcast-align]
Storable.xs: In function ‘last_op_in_netorder’:
Storable.xs: In function ‘store_scalar’:
Storable.xs:694:4: warning: cast increases required alignment of target type [-Wcast-align]
Storable.xs:2237:27: warning: declaration of ‘len’ shadows a previous local [-Wshadow]
Storable.xs:2050:9: warning: shadowed declaration is here [-Wshadow]
Storable.xs: In function ‘store_array’:
Storable.xs: In function ‘store_hash’:
Storable.xs:2581:8: warning: declaration of ‘len’ shadows a previous local [-Wshadow]
Storable.xs:2361:6: warning: shadowed declaration is here [-Wshadow]
Storable.xs: In function ‘store_code’:
Storable.xs: In function ‘store_tied_item’:
Storable.xs:2889:31: warning: cast increases required alignment of target type [-Wcast-align]
Storable.xs: In function ‘store_hook’:
Storable.xs:3216:9: warning: cast increases required alignment of target type [-Wcast-align]
Storable.xs: In function ‘store_blessed’:
Storable.xs: In function ‘store_other’:
Storable.xs: In function ‘store’:
Storable.xs: In function ‘do_store’:
Storable.xs: In function ‘mbuf2sv’:
Storable.xs: In function ‘retrieve_idx_blessed’:
Storable.xs:632:9: warning: cast increases required alignment of target type [-Wcast-align]
Storable.xs: In function ‘retrieve_blessed’:
Storable.xs: In function ‘retrieve_hook’:
Storable.xs: In function ‘retrieve_tied_idx’:
Storable.xs: In function ‘retrieve_lscalar’:
Storable.xs: In function ‘retrieve_lvstring’:
Storable.xs: In function ‘retrieve_netint’:
Storable.xs: In function ‘retrieve_svundef_elem’:
Storable.xs:1063:21: warning: cast increases required alignment of target type [-Wcast-align]
Storable.xs: In function ‘retrieve_array’:
Storable.xs: In function ‘retrieve_hash’:
Storable.xs: In function ‘retrieve_flag_hash’:
Storable.xs: In function ‘retrieve_code’:
Storable.xs: In function ‘old_retrieve_array’:
Storable.xs: In function ‘old_retrieve_hash’:
Storable.xs: In function ‘magic_check’:
Storable.xs: In function ‘retrieve’:
Storable.xs: In function ‘do_retrieve’:
Storable.xs: In function ‘dclone’:
Storable.xs:406:6: warning: declaration of ‘perinterp_sv’ shadows a previous local [-Wshadow]
Storable.xs:406:6: warning: shadowed declaration is here [-Wshadow]
Storable.xs:415:24: warning: declaration of ‘cxt’ shadows a previous local [-Wshadow]
Storable.xs:415:24: warning: shadowed declaration is here [-Wshadow]
Storable.xs: In function ‘storable_free’:
Storable.xs:6593:17: warning: cast increases required alignment of target type [-Wcast-align]
Storable.xs: In function ‘XS_Storable_last_op_in_netorder’:
Storable.c: In function ‘boot_Storable’:
Storable.c:6944:14: warning: declaration of ‘cv’ shadows a parameter [-Wshadow]
re_comp.c:9091:1: warning: inlining failed in call to ‘S_invlist_clone’: --param max-inline-insns-single limit reached [-Winline]
../../embed.h:579:24: warning: called from here [-Winline]
re_comp.c: In function ‘S_ssc_finalize’:
../../embed.h:977:26: warning: called from here [-Winline]
re_comp.c:9126:1: warning: inlining failed in call to ‘S_invlist_iterinit’: call is unlikely and code size would grow [-Winline]
../../embed.h:981:26: warning: called from here [-Winline]
re_comp.c:9134:1: warning: inlining failed in call to ‘S_invlist_iterfinish’: call is unlikely and code size would grow [-Winline]
../../embed.h:980:28: warning: called from here [-Winline]
../../embed.h:1033:30: warning: called from here [-Winline]
../../embed.h:1039:24: warning: called from here [-Winline]
re_comp.c:11385:1: warning: inlining failed in call to ‘S_compute_EXACTish’: call is unlikely and code size would grow [-Winline]
re_comp.c:15429:20: warning: called from here [-Winline]
re_comp.c:11407:1: warning: inlining failed in call to ‘S_alloc_maybe_populate_EXACT’: call is unlikely and code size would grow [-Winline]
../../embed.h:968:49: warning: called from here [-Winline]
../../inline.h:159:1: warning: inlining failed in call to ‘S_SvREFCNT_dec’: call is unlikely and code size would grow [-Winline]
../../sv.h:343:26: warning: called from here [-Winline]
re_comp.c:15933:28: warning: called from here [-Winline]
Syslog.c: In function ‘boot_Sys__Syslog’:
Syslog.c:566:5: warning: "XSubPPtmpAAAB" is not defined [-Wundef]
./const-xs.inc:256:11: warning: declaration of ‘cv’ shadows a parameter [-Wshadow]
./const-xs.inc:282:5: warning: "XSubPPtmpAAAB" is not defined [-Wundef]
re_comp.c: In function ‘S_regpiece’:
threads.xs: In function ‘S_ithread_clear’:
threads.xs: In function ‘ithread_mg_get’:
threads.xs:369:23: warning: cast increases required alignment of target type [-Wcast-align]
threads.xs: In function ‘ithread_mg_free’:
threads.xs:378:23: warning: cast increases required alignment of target type [-Wcast-align]
threads.xs: In function ‘ithread_mg_dup’:
threads.xs:389:31: warning: cast increases required alignment of target type [-Wcast-align]
threads.xs: In function ‘S_ithread_run’:
threads.xs: In function ‘S_ithread_create’:
../../perl.h:165:22: warning: declaration of ‘my_perl’ shadows a previous local [-Wshadow]
threads.xs: In function ‘XS_threads_create’:
threads.xs: In function ‘XS_threads_list’:
threads.xs: In function ‘XS_threads_kill’:
threads.xs: In function ‘XS_threads_set_thread_exit_only’:
threads.xs: In function ‘boot_threads’:
threads.xs:1770:27: warning: cast increases required alignment of target type [-Wcast-align]
re_comp.c: In function ‘S_study_chunk.constprop’:
re_comp.c:1503:1: warning: inlining failed in call to ‘S_ssc_add_range’: call is unlikely and code size would grow [-Winline]
../../embed.h:1010:30: warning: called from here [-Winline]
../../perl.h:165:22: warning: variable ‘my_perl’ might be clobbered by ‘longjmp’ or ‘vfork’ [-Wclobbered]
shared.xs:183:1: warning: no previous prototype for ‘recursive_lock_init’ [-Wmissing-prototypes]
shared.xs:191:1: warning: no previous prototype for ‘recursive_lock_destroy’ [-Wmissing-prototypes]
shared.xs:198:1: warning: no previous prototype for ‘recursive_lock_release’ [-Wmissing-prototypes]
shared.xs:211:1: warning: no previous prototype for ‘recursive_lock_acquire’ [-Wmissing-prototypes]
shared.xs:280:1: warning: no previous prototype for ‘sharedsv_userlock_free’ [-Wmissing-prototypes]
shared.xs: In function ‘sharedsv_userlock_free’:
shared.xs:282:21: warning: cast increases required alignment of target type [-Wcast-align]
shared.xs: In function ‘S_get_userlock’:
shared.xs:374:14: warning: cast increases required alignment of target type [-Wcast-align]
shared.xs:397:1: warning: no previous prototype for ‘Perl_sharedsv_find’ [-Wmissing-prototypes]
shared.xs: In function ‘Perl_sharedsv_find’:
shared.xs:406:25: warning: cast increases required alignment of target type [-Wcast-align]
shared.xs:415:25: warning: cast increases required alignment of target type [-Wcast-align]
shared.xs:433:1: warning: no previous prototype for ‘Perl_sharedsv_associate’ [-Wmissing-prototypes]
shared.xs: In function ‘Perl_sharedsv_associate’:
shared.xs:448:16: warning: cast increases required alignment of target type [-Wcast-align]
shared.xs:467:16: warning: cast increases required alignment of target type [-Wcast-align]
shared.xs:552:1: warning: no previous prototype for ‘Perl_sharedsv_share’ [-Wmissing-prototypes]
shared.xs:613:1: warning: no previous prototype for ‘Perl_sharedsv_cond_timedwait’ [-Wmissing-prototypes]
shared.xs: In function ‘S_get_RV’:
shared.xs:734:1: warning: no previous prototype for ‘sharedsv_scalar_mg_get’ [-Wmissing-prototypes]
shared.xs: In function ‘sharedsv_scalar_mg_get’:
shared.xs:736:15: warning: cast increases required alignment of target type [-Wcast-align]
../../sv.h:1207:17: warning: declaration of ‘_svrv’ shadows a previous local [-Wshadow]
../../sv.h:1207:17: warning: shadowed declaration is here [-Wshadow]
shared.xs:754:1: warning: no previous prototype for ‘sharedsv_scalar_store’ [-Wmissing-prototypes]
shared.xs: In function ‘sharedsv_scalar_store’:
shared.xs:761:13: warning: declaration of ‘sv’ shadows a parameter [-Wshadow]
shared.xs:754:33: warning: shadowed declaration is here [-Wshadow]
shared.xs:813:1: warning: no previous prototype for ‘sharedsv_scalar_mg_set’ [-Wmissing-prototypes]
shared.xs: In function ‘sharedsv_scalar_mg_set’:
shared.xs:815:15: warning: cast increases required alignment of target type [-Wcast-align]
shared.xs:832:1: warning: no previous prototype for ‘sharedsv_scalar_mg_free’ [-Wmissing-prototypes]
shared.xs: In function ‘sharedsv_scalar_mg_free’:
shared.xs:837:15: warning: cast increases required alignment of target type [-Wcast-align]
shared.xs:837:50: warning: cast increases required alignment of target type [-Wcast-align]
shared.xs:838:13: warning: declaration of ‘sv’ shadows a parameter [-Wshadow]
shared.xs:832:35: warning: shadowed declaration is here [-Wshadow]
shared.xs:840:25: warning: cast increases required alignment of target type [-Wcast-align]
shared.xs:842:26: warning: cast increases required alignment of target type [-Wcast-align]
shared.xs:851:1: warning: no previous prototype for ‘sharedsv_scalar_mg_dup’ [-Wmissing-prototypes]
shared.xs:863:1: warning: no previous prototype for ‘sharedsv_scalar_mg_local’ [-Wmissing-prototypes]
shared.xs: In function ‘sharedsv_scalar_mg_local’:
shared.xs:866:15: warning: cast increases required alignment of target type [-Wcast-align]
shared.xs:899:1: warning: no previous prototype for ‘sharedsv_elem_mg_FETCH’ [-Wmissing-prototypes]
shared.xs: In function ‘sharedsv_elem_mg_FETCH’:
shared.xs:918:28: warning: cast increases required alignment of target type [-Wcast-align]
shared.xs:920:28: warning: cast increases required alignment of target type [-Wcast-align]
shared.xs:949:1: warning: no previous prototype for ‘sharedsv_elem_mg_STORE’ [-Wmissing-prototypes]
shared.xs: In function ‘sharedsv_elem_mg_STORE’:
shared.xs:972:24: warning: cast increases required alignment of target type [-Wcast-align]
shared.xs:974:24: warning: cast increases required alignment of target type [-Wcast-align]
shared.xs:992:1: warning: no previous prototype for ‘sharedsv_elem_mg_DELETE’ [-Wmissing-prototypes]
shared.xs: In function ‘sharedsv_elem_mg_DELETE’:
shared.xs:1016:24: warning: cast increases required alignment of target type [-Wcast-align]
shared.xs:1018:24: warning: cast increases required alignment of target type [-Wcast-align]
shared.xs:1034:1: warning: no previous prototype for ‘sharedsv_elem_mg_dup’ [-Wmissing-prototypes]
shared.xs: In function ‘sharedsv_elem_mg_dup’:
shared.xs:1060:1: warning: no previous prototype for ‘sharedsv_array_mg_FETCHSIZE’ [-Wmissing-prototypes]
shared.xs: In function ‘sharedsv_array_mg_FETCHSIZE’:
shared.xs:1063:15: warning: cast increases required alignment of target type [-Wcast-align]
shared.xs:1080:1: warning: no previous prototype for ‘sharedsv_array_mg_CLEAR’ [-Wmissing-prototypes]
shared.xs: In function ‘sharedsv_array_mg_CLEAR’:
shared.xs:1083:15: warning: cast increases required alignment of target type [-Wcast-align]
shared.xs:1093:21: warning: declaration of ‘sv’ shadows a parameter [-Wshadow]
shared.xs:1080:35: warning: shadowed declaration is here [-Wshadow]
shared.xs:1114:1: warning: no previous prototype for ‘sharedsv_array_mg_free’ [-Wmissing-prototypes]
shared.xs: In function ‘sharedsv_array_mg_free’:
shared.xs:1117:26: warning: cast increases required alignment of target type [-Wcast-align]
shared.xs:1128:1: warning: no previous prototype for ‘sharedsv_array_mg_copy’ [-Wmissing-prototypes]
shared.xs:1147:1: warning: no previous prototype for ‘sharedsv_array_mg_dup’ [-Wmissing-prototypes]
shared.xs: In function ‘sharedsv_array_mg_dup’:
shared.xs:1150:23: warning: cast increases required alignment of target type [-Wcast-align]
shared.xs:1172:1: warning: no previous prototype for ‘Perl_sharedsv_unlock’ [-Wmissing-prototypes]
shared.xs:1184:1: warning: no previous prototype for ‘Perl_sharedsv_lock’ [-Wmissing-prototypes]
shared.xs:1196:1: warning: no previous prototype for ‘Perl_sharedsv_locksv’ [-Wmissing-prototypes]
shared.xs:1215:1: warning: no previous prototype for ‘Perl_shared_object_destroy’ [-Wmissing-prototypes]
shared.xs:1247:1: warning: no previous prototype for ‘Perl_sharedsv_init’ [-Wmissing-prototypes]
NamedCapture.xs: In function ‘XS_Tie__Hash__NamedCapture_TIEHASH’:
NamedCapture.xs: In function ‘XS_Tie__Hash__NamedCapture_FETCH’:
NamedCapture.xs: In function ‘XS_Tie__Hash__NamedCapture_FIRSTKEY’:
Unicode.xs:93:1: warning: no previous prototype for ‘enc_pack’ [-Wmissing-prototypes]
Unicode.xs: In function ‘XS_Encode__Unicode_decode_xs’:
../../../handy.h:64:35: warning: declaration of ‘_p’ shadows a previous local [-Wshadow]
../../../handy.h:64:35: warning: shadowed declaration is here [-Wshadow]
../../../sv.h:1753:32: warning: comparing floating point with == or != is unsafe [-Wfloat-equal]
Unicode.xs: In function ‘XS_Encode__Unicode_encode_xs’:
Piece.xs: In function ‘_strptime’:
Piece.xs:688:18: warning: comparison between signed and unsigned integer expressions [-Wsign-compare]
Piece.xs:782:18: warning: comparison between signed and unsigned integer expressions [-Wsign-compare]
Piece.xs:963:1: warning: no previous prototype for ‘push_common_tm’ [-Wmissing-prototypes]
Piece.xs:984:1: warning: no previous prototype for ‘return_11part_tm’ [-Wmissing-prototypes]
Piece.xs: In function ‘XS_Time__Piece__strftime’:
Piece.xs:1044:9: warning: format not a string literal, format string not checked [-Wformat-nonliteral]
Piece.xs:1059:29: warning: comparison between signed and unsigned integer expressions [-Wsign-compare]
Piece.xs:1070:13: warning: format not a string literal, format string not checked [-Wformat-nonliteral]
Piece.c: In function ‘boot_Time__Piece’:
Piece.c:1455:14: warning: declaration of ‘cv’ shadows a parameter [-Wshadow]
Piece.xs:350:13: warning: ‘copyright’ defined but not used [-Wunused-variable]
Piece.xs:352:13: warning: ‘sccsid’ defined but not used [-Wunused-variable]
stdio.c:14:8: warning: no previous prototype for ‘xsfopen’ [-Wmissing-prototypes]
stdio.c:20:5: warning: no previous prototype for ‘xsfclose’ [-Wmissing-prototypes]
stdio.c:25:5: warning: no previous prototype for ‘xsfprintf’ [-Wmissing-prototypes]
Typemap.xs:63:12: warning: no previous prototype for ‘intArrayPtr’ [-Wmissing-prototypes]
Typemap.xs:203:1: warning: no previous prototype for ‘XS_release_anotherstructPtrPtr’ [-Wmissing-prototypes]
Typemap.c: In function ‘XS_XS__Typemap_T_CVREF’:
Typemap.c:626:7: warning: declaration of ‘cv’ shadows a parameter [-Wshadow]
Typemap.c: In function ‘XS_XS__Typemap_T_CVREF_REFCOUNT_FIXED’:
Typemap.c:663:13: warning: declaration of ‘cv’ shadows a parameter [-Wshadow]
Typemap.c: In function ‘XS_XS__Typemap_T_BOOL’:
Typemap.c: In function ‘XS_XS__Typemap_T_BOOL_2’:
Typemap.c: In function ‘XS_XS__Typemap_T_BOOL_OUT’:
Typemap.c: In function ‘XS_XS__Typemap_T_OPAQUEPTR_OUT’:
Typemap.c:1355:17: warning: cast increases required alignment of target type [-Wcast-align]
Typemap.c: In function ‘XS_XS__Typemap_T_OPAQUEPTR_OUT_short’:
Typemap.c:1375:19: warning: cast increases required alignment of target type [-Wcast-align]
Typemap.c: In function ‘XS_XS__Typemap_T_OPAQUEPTR_OUT_struct’:
Typemap.c:1427:19: warning: cast increases required alignment of target type [-Wcast-align]
Typemap.c: In function ‘XS_XS__Typemap_T_OPAQUE_OUT’:
Typemap.c:1467:18: warning: cast increases required alignment of target type [-Wcast-align]
HiRes.xs:488:1: warning: no previous prototype for ‘hrt_ualarm_itimer’ [-Wmissing-prototypes]
HiRes.xs:495:1: warning: no previous prototype for ‘hrt_ualarm’ [-Wmissing-prototypes]
HiRes.xs:718:1: warning: function declaration isn’t a prototype [-Wstrict-prototypes]
HiRes.xs: In function ‘XS_Time__HiRes_setitimer’:
HiRes.xs:1112:16: warning: enum conversion when passing argument 1 of ‘setitimer’ is invalid in C++ [-Wc++-compat]
HiRes.xs: In function ‘XS_Time__HiRes_getitimer’:
HiRes.xs:1127:16: warning: enum conversion when passing argument 1 of ‘getitimer’ is invalid in C++ [-Wc++-compat]
HiRes.c: In function ‘boot_Time__HiRes’:
HiRes.c:1964:14: warning: declaration of ‘cv’ shadows a parameter [-Wshadow]
HiRes.c:1966:5: warning: "XSubPPtmpAAAA" is not defined [-Wundef]
HiRes.c:1975:5: warning: "XSubPPtmpAAAD" is not defined [-Wundef]
HiRes.c:1980:5: warning: "XSubPPtmpAAAE" is not defined [-Wundef]
HiRes.c:1987:5: warning: "XSubPPtmpAAAG" is not defined [-Wundef]
HiRes.c:1991:5: warning: "XSubPPtmpAAAH" is not defined [-Wundef]
HiRes.c:2006:5: warning: "XSubPPtmpAAAL" is not defined [-Wundef]
HiRes.c:2012:5: warning: "XSubPPtmpAAAN" is not defined [-Wundef]
HiRes.c:2018:5: warning: "XSubPPtmpAAAP" is not defined [-Wundef]
HiRes.c:2024:5: warning: "XSubPPtmpAAAR" is not defined [-Wundef]
HiRes.xs:785:5: warning: "XSubPPtmpAAAA" is not defined [-Wundef]
HiRes.xs:790:5: warning: "XSubPPtmpAAAD" is not defined [-Wundef]
HiRes.xs:793:5: warning: "XSubPPtmpAAAE" is not defined [-Wundef]
HiRes.xs:797:5: warning: "XSubPPtmpAAAG" is not defined [-Wundef]
HiRes.xs:799:5: warning: "XSubPPtmpAAAH" is not defined [-Wundef]
HiRes.xs:807:5: warning: "XSubPPtmpAAAL" is not defined [-Wundef]
HiRes.xs:811:5: warning: "XSubPPtmpAAAN" is not defined [-Wundef]
HiRes.xs:815:5: warning: "XSubPPtmpAAAP" is not defined [-Wundef]
HiRes.xs:819:5: warning: "XSubPPtmpAAAR" is not defined [-Wundef]
../../hv_func.h: In function ‘S_perl_hash_siphash_2_4’:
../../hv_func.h:213:17: warning: cast increases required alignment of target type [-Wcast-align]
../../hv_func.h:214:17: warning: cast increases required alignment of target type [-Wcast-align]
core_or_not.inc:13:6: warning: function declaration isn’t a prototype [-Wstrict-prototypes]
exception.c:17:5: warning: no previous prototype for ‘apitest_exception’ [-Wmissing-prototypes]
../../fakesdio.h:114:5: warning: "SFIO_VERSION" is not defined [-Wundef]
APItest.xs:43:1: warning: no previous prototype for ‘my_cxt_getint_p’ [-Wmissing-prototypes]
APItest.xs:49:1: warning: no previous prototype for ‘my_cxt_setint_p’ [-Wmissing-prototypes]
APItest.xs:55:1: warning: no previous prototype for ‘my_cxt_getsv_interp_context’ [-Wmissing-prototypes]
APItest.xs:63:1: warning: no previous prototype for ‘my_cxt_getsv_interp’ [-Wmissing-prototypes]
APItest.xs:70:1: warning: no previous prototype for ‘my_cxt_setsv_p’ [-Wmissing-prototypes]
APItest.xs:89:1: warning: no previous prototype for ‘test_freeent’ [-Wmissing-prototypes]
APItest.xs: In function ‘bitflip_key’:
APItest.xs:154:14: warning: declaration of ‘len’ shadows a previous local [-Wshadow]
APItest.xs:144:9: warning: shadowed declaration is here [-Wshadow]
APItest.xs: In function ‘THX_run_cleanup’:
APItest.xs: In function ‘THX_keyword_active’:
APItest.xs: In function ‘addissub_myck_add’:
APItest.xs: In function ‘my_ck_rv2cv’:
APItest.xs: In function ‘XS_XS__APItest__Overload_tryAMAGICunDEREF_var’:
APItest.xs:1348:11: warning: declaration of ‘sp’ shadows a previous local [-Wshadow]
APItest.xs: In function ‘XS_XS__APItest__Hash_delete’:
APItest.xs: In function ‘XS_XS__APItest__Hash_delete_ent’:
APItest.xs: In function ‘XS_XS__APItest__Hash_test_force_keys’:
Collate.xs: In function ‘XS_Unicode__Collate_mk_SortKey’:
APItest.xs: In function ‘XS_XS__APItest__PtrTable_fetch’:
../../perl.h:1735:26: warning: cast from function call of type ‘void *’ to non-matching type ‘long unsigned int’ [-Wbad-function-cast]
Collate.xs: In function ‘XS_Unicode__Collate_varCE’:
APItest.xs: In function ‘XS_XS__APItest_CLONE’:
APItest.c: In function ‘XS_XS__APItest_my_cxt_getsv’:
APItest.xs: In function ‘XS_XS__APItest_rmagical_cast’:
APItest.c: In function ‘XS_XS__APItest_bhk_record’:
APItest.c: In function ‘XS_XS__APItest_cv_set_call_checker_lists’:
APItest.c:4752:7: warning: declaration of ‘cv’ shadows a parameter [-Wshadow]
APItest.c: In function ‘XS_XS__APItest_cv_set_call_checker_scalars’:
APItest.c:4782:7: warning: declaration of ‘cv’ shadows a parameter [-Wshadow]
APItest.c: In function ‘XS_XS__APItest_cv_set_call_checker_proto’:
APItest.c:4812:7: warning: declaration of ‘cv’ shadows a parameter [-Wshadow]
APItest.c: In function ‘XS_XS__APItest_cv_set_call_checker_proto_or_list’:
APItest.c:4846:7: warning: declaration of ‘cv’ shadows a parameter [-Wshadow]
APItest.c: In function ‘XS_XS__APItest_cv_set_call_checker_multi_sum’:
APItest.c:4880:7: warning: declaration of ‘cv’ shadows a parameter [-Wshadow]
APItest.xs: In function ‘XS_XS__APItest_multicall_each’:
APItest.xs:3335:9: warning: declaration of ‘cv’ shadows a parameter [-Wshadow]
APItest.xs:3335:9: warning: shadowed declaration is here [-Wshadow]
APItest.xs: In function ‘XS_XS__APItest_clone_with_stack’:
APItest.c: In function ‘XS_XS__APItest_take_cvref’:
APItest.c:5658:6: warning: declaration of ‘cv’ shadows a parameter [-Wshadow]
APItest.c: In function ‘XS_XS__APItest_fetch_pad_names’:
APItest.c:5866:6: warning: declaration of ‘cv’ shadows a parameter [-Wshadow]
APItest.c: In function ‘XS_XS__APItest_lexical_import’:
APItest.c:6218:7: warning: declaration of ‘cv’ shadows a parameter [-Wshadow]
APItest.xs: In function ‘XS_XS__APItest_cv_name’:
APItest.xs: In function ‘XS_XS__APItest__Magic_mg_find_foo’:
APItest.xs:3863:32: warning: cast increases required alignment of target type [-Wcast-align]
APItest.xs: In function ‘XS_XS__APItest__Magic_test_get_vtbl’:
../../perl.h:1735:26: warning: cast from function call of type ‘struct MGVTBL *’ to non-matching type ‘long unsigned int’ [-Wbad-function-cast]
APItest.c: In function ‘boot_XS__APItest’:
APItest.c:9969:5: warning: "XSubPPtmpAAAE" is not defined [-Wundef]
./const-xs.inc:204:11: warning: declaration of ‘cv’ shadows a parameter [-Wshadow]
APItest.xs:3447:6: warning: declaration of ‘cv’ shadows a parameter [-Wshadow]
APItest.xs:3565:5: warning: "XSubPPtmpAAAE" is not defined [-Wundef]
FastCalc.xs: In function ‘XS_Math__BigInt__FastCalc___strip_zeros’:
FastCalc.xs:167:22: warning: comparing floating point with == or != is unsafe [-Wfloat-equal]
FastCalc.xs: In function ‘XS_Math__BigInt__FastCalc__acmp’:
FastCalc.xs:395:19: warning: comparing floating point with == or != is unsafe [-Wfloat-equal]
../../../../hv_func.h: In function ‘S_perl_hash_superfast’:
../../../../hv_func.h:272:18: warning: cast increases required alignment of target type [-Wcast-align]
../../../../hv_func.h: In function ‘S_perl_hash_murmur3’:
../../../../hv_func.h:376:16: warning: cast increases required alignment of target type [-Wcast-align]
../../../../hv_func.h:121:31: warning: cast increases required alignment of target type [-Wcast-align]
../../../../hv_func.h: In function ‘S_perl_hash_djb2’:
../../../../hv_func.h:470:18: warning: cast increases required alignment of target type [-Wcast-align]
../../../../hv_func.h: In function ‘S_perl_hash_sdbm’:
../../../../hv_func.h:480:18: warning: cast increases required alignment of target type [-Wcast-align]
../../../../hv_func.h: In function ‘S_perl_hash_one_at_a_time’:
../../../../hv_func.h:506:18: warning: cast increases required alignment of target type [-Wcast-align]
../../../../hv_func.h: In function ‘S_perl_hash_one_at_a_time_hard’:
../../../../hv_func.h:521:18: warning: cast increases required alignment of target type [-Wcast-align]
../../../../hv_func.h: In function ‘S_perl_hash_old_one_at_a_time’:
../../../../hv_func.h:556:18: warning: cast increases required alignment of target type [-Wcast-align]
ExtTest.xs: In function ‘boot_ExtTest’:
../../../../perl.h:165:22: warning: declaration of ‘my_perl’ shadows a parameter [-Wshadow]
../../../../perl.h:165:22: warning: shadowed declaration is here [-Wshadow]
ExtTest.xs:350:11: warning: declaration of ‘cv’ shadows a parameter [-Wshadow]
../../../../XSUB.h:141:51: warning: shadowed declaration is here [-Wshadow]
../../../../handy.h:64:35: warning: declaration of ‘_p’ shadows a previous local [-Wshadow]
../../../../handy.h:64:35: warning: shadowed declaration is here [-Wshadow]
compilet-uFRr1.c:1:5: warning: function declaration isn’t a prototype [-Wstrict-prototypes]
compilet-fvHfp.c:1:5: warning: function declaration isn’t a prototype [-Wstrict-prototypes]
t/basict.c:1:5: warning: no previous prototype for ‘boot_basict’ [-Wmissing-prototypes]
compilet-scEnH.c:1:5: warning: function declaration isn’t a prototype [-Wstrict-prototypes]
compilet-7J67d.c:1:5: warning: function declaration isn’t a prototype [-Wstrict-prototypes]
/home/njh/perl5/perl-build-smoker/perl-5.22.x/hv_func.h: In function ‘S_perl_hash_superfast’:
/home/njh/perl5/perl-build-smoker/perl-5.22.x/hv_func.h:272:18: warning: cast increases required alignment of target type [-Wcast-align]
/home/njh/perl5/perl-build-smoker/perl-5.22.x/hv_func.h: In function ‘S_perl_hash_murmur3’:
/home/njh/perl5/perl-build-smoker/perl-5.22.x/hv_func.h:376:16: warning: cast increases required alignment of target type [-Wcast-align]
/home/njh/perl5/perl-build-smoker/perl-5.22.x/hv_func.h:121:31: warning: cast increases required alignment of target type [-Wcast-align]
/home/njh/perl5/perl-build-smoker/perl-5.22.x/hv_func.h: In function ‘S_perl_hash_djb2’:
/home/njh/perl5/perl-build-smoker/perl-5.22.x/hv_func.h:470:18: warning: cast increases required alignment of target type [-Wcast-align]
/home/njh/perl5/perl-build-smoker/perl-5.22.x/hv_func.h: In function ‘S_perl_hash_sdbm’:
/home/njh/perl5/perl-build-smoker/perl-5.22.x/hv_func.h:480:18: warning: cast increases required alignment of target type [-Wcast-align]
/home/njh/perl5/perl-build-smoker/perl-5.22.x/hv_func.h: In function ‘S_perl_hash_one_at_a_time’:
/home/njh/perl5/perl-build-smoker/perl-5.22.x/hv_func.h:506:18: warning: cast increases required alignment of target type [-Wcast-align]
/home/njh/perl5/perl-build-smoker/perl-5.22.x/hv_func.h: In function ‘S_perl_hash_one_at_a_time_hard’:
/home/njh/perl5/perl-build-smoker/perl-5.22.x/hv_func.h:521:18: warning: cast increases required alignment of target type [-Wcast-align]
/home/njh/perl5/perl-build-smoker/perl-5.22.x/hv_func.h: In function ‘S_perl_hash_old_one_at_a_time’:
/home/njh/perl5/perl-build-smoker/perl-5.22.x/hv_func.h:556:18: warning: cast increases required alignment of target type [-Wcast-align]
XSTest.xs:6:1: warning: no previous prototype for ‘xstest_something’ [-Wmissing-prototypes]
XSTest.xs:12:1: warning: no previous prototype for ‘xstest_something2’ [-Wmissing-prototypes]
XSTest.c: In function ‘XS_XSTest_T_BOOL’:
/home/njh/perl5/perl-build-smoker/perl-5.22.x/sv.h:1753:32: warning: comparing floating point with == or != is unsafe [-Wfloat-equal]
XSTest.c: In function ‘XS_XSTest_T_BOOL_2’:
XSTest.c:306:7: warning: unused variable ‘RETVAL’ [-Wunused-variable]
XSTest.c: In function ‘XS_XSTest_T_BOOL_OUT’:
compilet-F7R5D.c:1:5: warning: function declaration isn’t a prototype [-Wstrict-prototypes]
XSMore.c: In function ‘XS_XSMore_nil’:
/home/njh/perl5/perl-build-smoker/perl-5.22.x/XSUB.h:164:20: warning: unused variable ‘items’ [-Wunused-variable]
compilet-oDSro.c:1:5: warning: function declaration isn’t a prototype [-Wstrict-prototypes]
XSUsage.xs:19:5: warning: function declaration isn’t a prototype [-Wstrict-prototypes]
XSUsage.xs:20:5: warning: function declaration isn’t a prototype [-Wstrict-prototypes]
XSUsage.xs:21:5: warning: function declaration isn’t a prototype [-Wstrict-prototypes]
XSUsage.xs:22:5: warning: function declaration isn’t a prototype [-Wstrict-prototypes]
XSUsage.xs:23:5: warning: no previous prototype for ‘xsusage_five’ [-Wmissing-prototypes]
XSUsage.xs:24:5: warning: no previous prototype for ‘xsusage_six’ [-Wmissing-prototypes]
XSUsage.c: In function ‘XS_XSUsage_two’:
/home/njh/perl5/perl-build-smoker/perl-5.22.x/XSUB.h:201:20: warning: unused variable ‘ix’ [-Wunused-variable]
XSUsage.c: In function ‘XS_XSUsage_interface_v_i’:
XSUsage.c:220:5: warning: function declaration isn’t a prototype [-Wstrict-prototypes]
XSUsage.c:226:5: warning: function declaration isn’t a prototype [-Wstrict-prototypes]
XSUsage.c: In function ‘XS_XSUsage_four’:
XSUsage.c: In function ‘boot_XSUsage’:
XSUsage.c:323:14: warning: declaration of ‘cv’ shadows a parameter [-Wshadow]
/home/njh/perl5/perl-build-smoker/perl-5.22.x/XSUB.h:141:51: warning: shadowed declaration is here [-Wshadow]
/home/njh/perl5/perl-build-smoker/perl-5.22.x/perl.h:165:22: warning: declaration of ‘my_perl’ shadows a parameter [-Wshadow]
/home/njh/perl5/perl-build-smoker/perl-5.22.x/perl.h:165:22: warning: shadowed declaration is here [-Wshadow]
../hv_func.h: In function ‘S_perl_hash_superfast’:
../hv_func.h:272:18: warning: cast increases required alignment of target type [-Wcast-align]
../hv_func.h: In function ‘S_perl_hash_murmur3’:
../hv_func.h:376:16: warning: cast increases required alignment of target type [-Wcast-align]
../hv_func.h:121:31: warning: cast increases required alignment of target type [-Wcast-align]
../hv_func.h: In function ‘S_perl_hash_djb2’:
../hv_func.h:470:18: warning: cast increases required alignment of target type [-Wcast-align]
../hv_func.h: In function ‘S_perl_hash_sdbm’:
../hv_func.h:480:18: warning: cast increases required alignment of target type [-Wcast-align]
../hv_func.h: In function ‘S_perl_hash_one_at_a_time’:
../hv_func.h:506:18: warning: cast increases required alignment of target type [-Wcast-align]
../hv_func.h: In function ‘S_perl_hash_one_at_a_time_hard’:
../hv_func.h:521:18: warning: cast increases required alignment of target type [-Wcast-align]
../hv_func.h: In function ‘S_perl_hash_old_one_at_a_time’:
../hv_func.h:556:18: warning: cast increases required alignment of target type [-Wcast-align]

-- 
Report by Test::Smoke v1.53 build 1374 running on perl 5.20.2
(Reporter v0.050 / Smoker v0.045)



nntp.perl.org: Perl Programming lists via nntp and http.
Comments to Ask Bjørn Hansen at ask@perl.org | Group listing | About