develooper Front page | perl.perl5.porters | Postings from February 2016

Re: Smoke [blead] v5.23.8-19-ga975eeb FAIL(X) os/390 24.00 (2964/)

Thread Next
From:
Karl Williamson
Date:
February 26, 2016 04:21
Subject:
Re: Smoke [blead] v5.23.8-19-ga975eeb FAIL(X) os/390 24.00 (2964/)
Message ID:
56CFD2A9.4040904@khwilliamson.com
On 02/25/2016 03:02 AM, Yaroslav Kuzmin wrote:
>
>   Smoke log available at https://drive.google.com/file/d/0B5PTttxwo7qAVnlkd0tzdlNNVFk
>
> Automated smoke report for branch blead 5.23.9 patch a975eebad193acb8e3a92283cb3cdad1480b6ddc
> v5.23.8-19-ga975eeb
> RS12: 2964 (2964/)
>      on        os/390 - 24.00
>      using     c99 version
>      smoketime 4 hours 36 minutes (average 2 hours 18 minutes)
>
> Summary: FAIL(X)

OK.  There are lots of failures, but the good news is that the ones 
involving sockets and the like haven't shown back up, and the smoke 
headline  correctly indicates failure.

Further good news for me is that smokes on HP-UX appear to be failing 
nearly identically, and I have hands-on access to a box running that, so 
I can debug it without having to bother you.  But I would like some 
debug output of the smoke test that was failing earlier, charset.t

./perl -Dr -Ilib re/charset.t

and capture the output (some is to stderr) and send it to me.

Thanks

In the meantime, I suggest resuming your regular schedule of blead 
smokes to guard against new issues creeping in.  I think once a week is 
probably enough.

>
> O = OK  F = Failure(s), extended report at the bottom
> X = Failure(s) under TEST but not under harness
> ? = still running or test results not (yet) available
> Build failures during:       - = unknown or N/A
> c = Configure, m = make, M = make (after miniperl), t = make test-prep
>
> v5.23.8-19-ga975eeb  Configuration (common) none
> ----------- ---------------------------------------------------------
> X X X X     -Dusedl
>>>> +----- PERLIO = perlio -DDEBUGGING
>>> +------- PERLIO = stdio  -DDEBUGGING
>> +--------- PERLIO = perlio
> +----------- PERLIO = stdio
>
>
> Locally applied patches:
>      SMOKEa975eebad193acb8e3a92283cb3cdad1480b6ddc
>
> Tests skipped on user request:
>      # One test name on a line
> Failures: (common-args) none
> [stdio] -Dusedl
> Inconsistent test results (between TEST and harness):
>      ../t/re/fold_grind.t.................... ............................................... FAILED
> at test 97
>      ../t/re/charset.t....................... ..................................................
> FAILED at test 1441
>      ../t/re/regexp_noamp.t.................. ............................................. FAILED
> at test 1896
>      ../t/re/regex_sets_compat.t............. ........................................ FAILED at
> test 1896
>      ../t/re/pat.t........................... ......................................................
> FAILED at test 733
>      ../t/re/regexp_trielist.t............... .......................................... FAILED at
> test 1896
>      ../t/re/pat_advanced.t.................. ............................................. FAILED-
> -no leader found
>      ../t/re/regexp.t........................ ...................................................
> FAILED at test 1896
>      ../t/re/regexp_notrie.t................. ............................................ FAILED at
> test 1896
>      ../t/re/regexp_qr_embed.t............... .......................................... FAILED at
> test 1896
>      ../t/re/regexp_qr.t..................... ................................................
> FAILED at test 1896
>
> [perlio] -Dusedl
> Inconsistent test results (between TEST and harness):
>      ../t/re/regex_sets_compat.t............. ........................................ FAILED at
> test 1896
>      ../t/re/pat.t........................... ......................................................
> FAILED at test 733
>      ../t/re/charset.t....................... ..................................................
> FAILED at test 1441
>      ../t/re/fold_grind.t.................... ............................................... FAILED
> at test 97
>      ../t/re/regexp_noamp.t.................. ............................................. FAILED
> at test 1896
>      ../t/re/regexp_trielist.t............... .......................................... FAILED at
> test 1896
>      ../t/re/pat_advanced.t.................. ............................................. FAILED-
> -no leader found
>      ../t/re/regexp_qr.t..................... ................................................
> FAILED at test 1896
>      ../t/re/regexp_qr_embed.t............... .......................................... FAILED at
> test 1896
>      ../t/re/regexp.t........................ ...................................................
> FAILED at test 1896
>      ../t/re/regexp_notrie.t................. ............................................ FAILED at
> test 1896
>
> [stdio] -DDEBUGGING -Dusedl
> Inconsistent test results (between TEST and harness):
>      ../t/re/pat_advanced.t.................. ............................................. FAILED-
> -no leader found
>      ../t/re/regexp_notrie.t................. ............................................ FAILED at
> test 1896
>      ../t/re/regexp.t........................ ...................................................
> FAILED at test 1896
>      ../t/re/regexp_qr_embed.t............... .......................................... FAILED at
> test 1896
>      ../t/re/regexp_qr.t..................... ................................................
> FAILED at test 1896
>      ../t/re/regexp_noamp.t.................. ............................................. FAILED
> at test 1896
>      ../t/re/fold_grind.t.................... ............................................... FAILED
> at test 97
>      ../t/re/charset.t....................... ..................................................
> FAILED at test 1441
>      ../t/re/pat.t........................... ......................................................
> FAILED at test 733
>      ../t/re/regex_sets_compat.t............. ........................................ FAILED at
> test 1896
>      ../t/re/regexp_trielist.t............... .......................................... FAILED at
> test 1896
>
> [perlio] -DDEBUGGING -Dusedl
> Inconsistent test results (between TEST and harness):
>      ../t/re/pat_advanced.t.................. ............................................. FAILED-
> -no leader found
>      ../t/re/regexp_qr.t..................... ................................................
> FAILED at test 1896
>      ../t/re/regexp_qr_embed.t............... .......................................... FAILED at
> test 1896
>      ../t/re/regexp_notrie.t................. ............................................ FAILED at
> test 1896
>      ../t/re/regexp.t........................ ...................................................
> FAILED at test 1896
>      ../t/re/regexp_noamp.t.................. ............................................. FAILED
> at test 1896
>      ../t/re/fold_grind.t.................... ............................................... FAILED
> at test 97
>      ../t/re/charset.t....................... ..................................................
> FAILED at test 1441
>      ../t/re/pat.t........................... ......................................................
> FAILED at test 733
>      ../t/re/regex_sets_compat.t............. ........................................ FAILED at
> test 1896
>      ../t/re/regexp_trielist.t............... .......................................... FAILED at
> test 1896
>
> Compiler messages(os390):
>
>
>
> --
> Report by Test::Smoke v1.6 running on perl 5.22.0
> (Reporter v0.052 / Smoker v0.045)
>
>
> --
> Regards,
>
> Yaroslav Kuzmin
> Developer C/C++ ,z/OS , Linux
> 3 Zhukovskiy Street · Miass, Chelyabinsk region 456318 · Russia
> Tel:  +7.922.2.38.33.38
> Email: YKuzmin@rocketsoftware.com
> Web: www.rocketsoftware.com
> ================================
> Rocket Software, Inc. and subsidiaries ■ 77 Fourth Avenue, Waltham MA 02451 ■ +1 877.328.2932 ■ +1 781.577.4321
> Unsubscribe From Commercial Email – unsubscribe@rocketsoftware.com
> Manage Your Subscription Preferences - http://info.rocketsoftware.com/GlobalSubscriptionManagementEmailFooter_SubscriptionCenter.html
> Privacy Policy - http://www.rocketsoftware.com/company/legal/privacy-policy
> ================================
>
> This communication and any attachments may contain confidential information of Rocket Software, Inc. All unauthorized use, disclosure or distribution is prohibited. If you are not the intended recipient, please notify Rocket Software immediately and destroy all copies of this communication. Thank you.
>


Thread Next


nntp.perl.org: Perl Programming lists via nntp and http.
Comments to Ask Bjørn Hansen at ask@perl.org | Group listing | About