develooper Front page | perl.perl5.porters | Postings from November 2015

Smoke [ebcdic] v5.23.5-146-gcbabdf2 FAIL(X) os/390 24.00 (2964/)

Thread Next
From:
Yaroslav Kuzmin
Date:
November 30, 2015 09:43
Subject:
Smoke [ebcdic] v5.23.5-146-gcbabdf2 FAIL(X) os/390 24.00 (2964/)
Message ID:
1448876564.3338.0.camel@rocketsoftware.com

 Smoke log available at https://drive.google.com/file/d/0B5PTttxwo7qAd2dkUURIZ0JFVjg

Automated smoke report for branch ebcdic 5.23.6 patch cbabdf2d4492e729fcb643d87435392a216e998b
v5.23.5-146-gcbabdf2
RS12: 2964 (2964/)
    on        os/390 - 24.00
    using     c99 version
    smoketime 4 hours 24 minutes (average 2 hours 12 minutes)

Summary: FAIL(X)

O = OK  F = Failure(s), extended report at the bottom
X = Failure(s) under TEST but not under harness
? = still running or test results not (yet) available
Build failures during:       - = unknown or N/A
c = Configure, m = make, M = make (after miniperl), t = make test-prep

v5.23.5-146-gcbabdf2  Configuration (common) none
----------- ---------------------------------------------------------
X X X X     -Dusedl
> > > +----- PERLIO = perlio -DDEBUGGING
> > +------- PERLIO = stdio  -DDEBUGGING
> +--------- PERLIO = perlio
+----------- PERLIO = stdio


Locally applied patches:
    SMOKEcbabdf2d4492e729fcb643d87435392a216e998b

Tests skipped on user request:
    # One test name on a line
Failures: (common-args) none
[stdio] -Dusedl
Inconsistent test results (between TEST and harness):
    ../t/cpan/Encode/t/at-cn.t.............. ........................................... FAILED at
test 1
    ../t/cpan/Encode/t/guess.t.............. ........................................... FAILED at
test 3
    ../t/cpan/Encode/t/jis7-fallback.t...... ................................... FAILED--no leader
found
    ../t/cpan/Encode/t/Encode.t............. .......................................... FAILED at
test 6
    ../t/cpan/Encode/t/perlio.t............. .......................................... FAILED-
-expected 38 tests, saw 0
    ../t/cpan/Encode/t/mime-name.t.......... ....................................... FAILED-
-expected 68 tests, saw 2
    ../t/cpan/Encode/t/gsm0338.t............ ......................................... FAILED at
test 11
    ../t/cpan/Encode/t/fallback.t........... ........................................ FAILED at
test 1
    ../ext/XS-APItest/t/utf8.t.............. ......................................... FAILED at
test 9002
    ../t/cpan/Encode/t/mime-header.t........ ..................................... FAILED at test 2

[perlio] -Dusedl
Inconsistent test results (between TEST and harness):
    ../t/cpan/Encode/t/jis7-fallback.t...... ................................... FAILED--no leader
found
    ../t/cpan/Encode/t/guess.t.............. ........................................... FAILED at
test 3
    ../t/cpan/Encode/t/at-cn.t.............. ........................................... FAILED at
test 1
    ../t/cpan/Encode/t/Encode.t............. .......................................... FAILED at
test 6
    ../t/cpan/Encode/t/perlio.t............. .......................................... FAILED-
-expected 38 tests, saw 0
    ../t/cpan/Encode/t/gsm0338.t............ ......................................... FAILED at
test 11
    ../t/cpan/Encode/t/mime-name.t.......... ....................................... FAILED-
-expected 68 tests, saw 2
    ../t/cpan/Encode/t/fallback.t........... ........................................ FAILED at
test 1
    ../ext/XS-APItest/t/utf8.t.............. ......................................... FAILED at
test 9002
    ../t/cpan/Encode/t/mime-header.t........ ..................................... FAILED at test 2

[stdio] -DDEBUGGING -Dusedl
Inconsistent test results (between TEST and harness):
    ../t/cpan/Encode/t/fallback.t........... ........................................ FAILED at
test 1
    ../ext/XS-APItest/t/utf8.t.............. ......................................... FAILED at
test 9002
    ../t/cpan/Encode/t/mime-header.t........ ..................................... FAILED at test 2
    ../t/cpan/Encode/t/at-cn.t.............. ........................................... FAILED at
test 1
    ../t/cpan/Encode/t/guess.t.............. ........................................... FAILED at
test 3
    ../t/cpan/Encode/t/jis7-fallback.t...... ................................... FAILED--no leader
found
    ../t/cpan/Encode/t/Encode.t............. .......................................... FAILED-
-expected 2703 tests, saw 5
    ../t/cpan/Encode/t/perlio.t............. .......................................... FAILED-
-expected 38 tests, saw 0
    ../t/cpan/Encode/t/mime-name.t.......... ....................................... FAILED-
-expected 68 tests, saw 2
    ../t/cpan/Encode/t/gsm0338.t............ ......................................... FAILED at
test 11

[perlio] -DDEBUGGING -Dusedl
Inconsistent test results (between TEST and harness):
    ../t/cpan/Encode/t/fallback.t........... ........................................ FAILED at
test 1
    ../ext/XS-APItest/t/utf8.t.............. ......................................... FAILED at
test 9002
    ../t/cpan/Encode/t/mime-header.t........ ..................................... FAILED at test 2
    ../t/cpan/Encode/t/jis7-fallback.t...... ................................... FAILED--no leader
found
    ../t/cpan/Encode/t/guess.t.............. ........................................... FAILED at
test 3
    ../t/cpan/Encode/t/at-cn.t.............. ........................................... FAILED at
test 1
    ../t/cpan/Encode/t/Encode.t............. .......................................... FAILED-
-expected 2703 tests, saw 5
    ../t/cpan/Encode/t/perlio.t............. .......................................... FAILED-
-expected 38 tests, saw 0
    ../t/cpan/Encode/t/gsm0338.t............ ......................................... FAILED at
test 11
    ../t/cpan/Encode/t/mime-name.t.......... ....................................... FAILED-
-expected 68 tests, saw 2

Compiler messages(os390):



--
Report by Test::Smoke v1.6 running on perl 5.22.0
(Reporter v0.052 / Smoker v0.045)


--
Regards,

Yaroslav Kuzmin
Developer C/C++ ,z/OS , Linux
3 Zhukovskiy Street · Miass, Chelyabinsk region 456318 · Russia
Tel:  +7.922.2.38.33.38
Email: YKuzmin@rocketsoftware.com
Web: www.rocketsoftware.com
================================
Rocket Software, Inc. and subsidiaries ■ 77 Fourth Avenue, Waltham MA 02451 ■ +1 800.966.3270 ■ +1 781.577.4321
Unsubscribe From Commercial Email – unsubscribe@rocketsoftware.com
Manage Your Subscription Preferences - http://info.rocketsoftware.com/GlobalSubscriptionManagementEmailFooter_SubscriptionCenter.html
Privacy Policy - http://www.rocketsoftware.com/company/legal/privacy-policy
================================

This communication and any attachments may contain confidential information of Rocket Software, Inc. All unauthorized use, disclosure or distribution is prohibited. If you are not the intended recipient, please notify Rocket Software immediately and destroy all copies of this communication. Thank you.

Thread Next


nntp.perl.org: Perl Programming lists via nntp and http.
Comments to Ask Bjørn Hansen at ask@perl.org | Group listing | About