develooper Front page | perl.perl5.porters | Postings from November 2015

Smoke [blead] v5.23.5-66-gc0236af FAIL(X) os/390 24.00 (2964/)

Thread Next
From:
Yaroslav Kuzmin
Date:
November 26, 2015 10:52
Subject:
Smoke [blead] v5.23.5-66-gc0236af FAIL(X) os/390 24.00 (2964/)
Message ID:
1448535139.32089.1.camel@rocketsoftware.com

 Smoke log available at https://drive.google.com/file/d/0B5PTttxwo7qAaFlUU1JwdjNOUW8

Automated smoke report for branch blead 5.23.6 patch c0236afee0c5845d3823612c5cd34eccc4d29321
v5.23.5-66-gc0236af
RS12: 2964 (2964/)
    on        os/390 - 24.00
    using     c99 version
    smoketime 4 hours 59 minutes (average 2 hours 29 minutes)

Summary: FAIL(X)

O = OK  F = Failure(s), extended report at the bottom
X = Failure(s) under TEST but not under harness
? = still running or test results not (yet) available
Build failures during:       - = unknown or N/A
c = Configure, m = make, M = make (after miniperl), t = make test-prep

v5.23.5-66-gc0236af  Configuration (common) none
----------- ---------------------------------------------------------
X X X X     -Dusedl
> > > +----- PERLIO = perlio -DDEBUGGING
> > +------- PERLIO = stdio  -DDEBUGGING
> +--------- PERLIO = perlio
+----------- PERLIO = stdio


Locally applied patches:
    SMOKEc0236afee0c5845d3823612c5cd34eccc4d29321

Tests skipped on user request:
    # One test name on a line
Failures: (common-args) none
[stdio] -Dusedl
[perlio] -DDEBUGGING -Dusedl
Inconsistent test results (between TEST and harness):
    ../t/dist/encoding-warnings/t/2-fatal.t. .............................. FAILED--expected 2
tests, saw 0
    ../t/dist/encoding-warnings/t/4-lexical.t ............................ FAILED--expected 3
tests, saw 0
    ../t/dist/encoding-warnings/t/1-warning.t ............................ FAILED--expected 2
tests, saw 0

[perlio] -Dusedl
Inconsistent test results (between TEST and harness):
    ../t/dist/encoding-warnings/t/1-warning.t ............................ FAILED--expected 2
tests, saw 0
    ../t/dist/encoding-warnings/t/4-lexical.t ............................ FAILED--expected 3
tests, saw 0
    ../t/dist/encoding-warnings/t/2-fatal.t. .............................. FAILED--expected 2
tests, saw 0

[stdio] -DDEBUGGING -Dusedl
Inconsistent test results (between TEST and harness):
    ../t/dist/encoding-warnings/t/4-lexical.t ............................ FAILED--expected 3
tests, saw 0
    ../t/dist/encoding-warnings/t/2-fatal.t. .............................. FAILED--expected 2
tests, saw 0
    ../t/dist/encoding-warnings/t/1-warning.t ............................ FAILED--expected 2
tests, saw 0

Compiler messages(os390):



--
Report by Test::Smoke v1.6 running on perl 5.22.0
(Reporter v0.052 / Smoker v0.045)


--
Regards,

Yaroslav Kuzmin
Developer C/C++ ,z/OS , Linux
3 Zhukovskiy Street · Miass, Chelyabinsk region 456318 · Russia
Tel:  +7.922.2.38.33.38
Email: YKuzmin@rocketsoftware.com
Web: www.rocketsoftware.com
================================
Rocket Software, Inc. and subsidiaries ■ 77 Fourth Avenue, Waltham MA 02451 ■ +1 800.966.3270 ■ +1 781.577.4321
Unsubscribe From Commercial Email – unsubscribe@rocketsoftware.com
Manage Your Subscription Preferences - http://info.rocketsoftware.com/GlobalSubscriptionManagementEmailFooter_SubscriptionCenter.html
Privacy Policy - http://www.rocketsoftware.com/company/legal/privacy-policy
================================

This communication and any attachments may contain confidential information of Rocket Software, Inc. All unauthorized use, disclosure or distribution is prohibited. If you are not the intended recipient, please notify Rocket Software immediately and destroy all copies of this communication. Thank you.

Thread Next


nntp.perl.org: Perl Programming lists via nntp and http.
Comments to Ask Bjørn Hansen at ask@perl.org | Group listing | About