develooper Front page | perl.perl5.porters | Postings from May 2015

Smoke [5.18.4] v5.18.4-1-g12a9c80 FAIL(Xc) linux 3.16.0-4-amd64[debian] (x86_64/12 cpu)

From:
njh
Date:
May 6, 2015 11:37
Subject:
Smoke [5.18.4] v5.18.4-1-g12a9c80 FAIL(Xc) linux 3.16.0-4-amd64[debian] (x86_64/12 cpu)
Message ID:
201505061136.t46BaqlF020451@compaq.bandsman.co.uk
Automated smoke report for 5.18.4 patch 12a9c803691f506670eb98308dbc5686d775c17d v5.18.4-1-g12a9c80
cyberpower2: Intel(R) Core(TM) i7-4960X CPU @ 3.60GHz (GenuineIntel 2307MHz) (x86_64/12 cpu)
    on        linux - 3.16.0-4-amd64 [debian]
    using      gcc-5 version 5.1.1
    smoketime 12 minutes 42 seconds (average 4 minutes 14 seconds)

Summary: FAIL(Xc)

O = OK  F = Failure(s), extended report at the bottom
X = Failure(s) under TEST but not under harness
? = still running or test results not (yet) available
Build failures during:       - = unknown or N/A
c = Configure, m = make, M = make (after miniperl), t = make test-prep

v5.18.4-1-g12a9c80  Configuration (common) none
----------- ---------------------------------------------------------
c -         -Accflags="-O2 -W -Wformat=2 -Wswitch -Wshadow -Wwrite-strings -Wuninitialized -Wall -pipe -mtune=native -march=native -fomit-frame-pointer -msse2 -msse -mmmx -mfpmath=sse -D_FORTIFY_SOURCE=2 -Wpointer-arith -Wstrict-prototypes -fstack-protector -Wstack-protector -Wextra -Wbad-function-cast -Wcast-align -Wcast-qual -Wdisabled-optimization -Wendif-labels -Wfloat-equal -Wformat-nonliteral -Winline -Wmissing-declarations -Wmissing-prototypes -Wnested-externs -Wpointer-arith -Wundef -Wformat-security -ftree-vectorize -fsanitize=bounds" -Duseithreads
X -         -Acc=gcc-5 -Duseithreads
c -         -Aldflags="-fsanitize=bounds" -Duseithreads
| +--------- -DDEBUGGING
+----------- no debugging


Locally applied patches:
    SMOKE12a9c803691f506670eb98308dbc5686d775c17d

Failures: (common-args) none
[default] -Acc=gcc-5 -Duseithreads
Inconsistent test results (between TEST and harness):
    ../t/cpan/HTTP-Tiny/t/150_post_form.t... ................................ FAILED--no leader found
    ../t/op/magic.t......................... .................................................... FAILED at test 105
    ../t/dist/autouse/t/autouse.t........... ........................................ FAILED--expected 15 tests, saw 8
    ../t/cpan/HTTP-Tiny/t/140_proxy.t....... .................................... FAILED--no leader found
    ../t/cpan/HTTP-Tiny/t/00-compile.t...... ................................... FAILED at test 1
    ../t/cpan/HTTP-Tiny/t/110_mirror.t...... ................................... FAILED--no leader found
    ../t/cpan/HTTP-Tiny/t/102_put.t......... ...................................... FAILED--no leader found
    ../t/cpan/HTTP-Tiny/t/103_delete.t...... ................................... FAILED--no leader found
    ../t/dist/IO/t/io_multihomed.t.......... ....................................... FAILED--expected test 6, saw test 8
    ../t/cpan/HTTP-Tiny/t/003_agent.t....... .................................... FAILED--expected 3 tests, saw 0
    ../t/cpan/HTTP-Tiny/t/050_chunked_body.t ............................. FAILED--no leader found
    ../t/cpan/HTTP-Tiny/t/100_get.t......... ...................................... FAILED--no leader found
    ../t/op/range.t......................... .................................................... FAILED at test 84
    ../t/cpan/HTTP-Tiny/t/002_croakage.t.... ................................. FAILED--no leader found
    ../t/op/numconvert.t.................... ............................................... FAILED at test 104
    ../t/cpan/HTTP-Tiny/t/101_head.t........ ..................................... FAILED--no leader found
    ../t/cpan/HTTP-Tiny/t/104_post.t........ ..................................... FAILED--no leader found
    ../t/cpan/HTTP-Tiny/t/130_redirect.t.... ................................. FAILED--no leader found
    ../t/cpan/Socket/t/socketpair.t......... ...................................... FAILED at test 14
    ../t/cpan/HTTP-Tiny/t/020_headers.t..... .................................. FAILED--no leader found
    ../t/cpan/HTTP-Tiny/t/001_api.t......... ...................................... FAILED--expected 2 tests, saw 0
    ../t/cpan/HTTP-Tiny/t/000_load.t........ ..................................... FAILED at test 1
    ../t/cpan/HTTP-Tiny/t/060_http_date.t... ................................ FAILED--no leader found
    ../t/re/reg_namedcapture.t.............. ......................................... FAILED at test 2
    ../t/run/switches.t..................... ................................................ FAILED--no leader found
    ../t/cpan/HTTP-Tiny/t/030_response.t.... ................................. FAILED--no leader found
    ../t/cpan/HTTP-Tiny/t/010_url.t......... ...................................... FAILED--no leader found
    ../t/cpan/HTTP-Tiny/t/040_content.t..... .................................. FAILED--no leader found

Compiler messages(gcc):
pp.c: In function ‘Perl_pp_undef’:
hv.h:430:39: warning: right-hand operand of comma expression has no effect [-Wunused-value]
scope.c: In function ‘Perl_leave_scope’:
compress.c: In function ‘sendMTFValues’:
compress.c:243:19: warning: variable ‘nBytes’ set but not used [-Wunused-but-set-variable]
POSIX.o: In function `XS_POSIX_tmpnam':

-- 
Report by Test::Smoke v1.53 build 1374 running on perl 5.20.2
(Reporter v0.050 / Smoker v0.045)



nntp.perl.org: Perl Programming lists via nntp and http.
Comments to Ask Bjørn Hansen at ask@perl.org | Group listing | About