develooper Front page | perl.perl5.porters | Postings from May 2015

Smoke [5.14.4] v5.14.4-2-g5875c53 FAIL(Xc) linux 3.16.0-4-amd64[debian] (x86_64/12 cpu)

From:
njh
Date:
May 6, 2015 10:36
Subject:
Smoke [5.14.4] v5.14.4-2-g5875c53 FAIL(Xc) linux 3.16.0-4-amd64[debian] (x86_64/12 cpu)
Message ID:
201505061035.t46AZnr7010495@compaq.bandsman.co.uk
Automated smoke report for 5.14.4 patch 5875c53b4ef8c948011dc6f4e7e4ae4e6effd6aa v5.14.4-2-g5875c53
cyberpower2: Intel(R) Core(TM) i7-4960X CPU @ 3.60GHz (GenuineIntel 3160MHz) (x86_64/12 cpu)
    on        linux - 3.16.0-4-amd64 [debian]
    using      gcc-5 version 5.1.1
    smoketime 11 minutes 41 seconds (average 3 minutes 53.667 seconds)

Summary: FAIL(Xc)

O = OK  F = Failure(s), extended report at the bottom
X = Failure(s) under TEST but not under harness
? = still running or test results not (yet) available
Build failures during:       - = unknown or N/A
c = Configure, m = make, M = make (after miniperl), t = make test-prep

v5.14.4-2-g5875c53  Configuration (common) none
----------- ---------------------------------------------------------
c -         -Accflags="-O2 -W -Wformat=2 -Wswitch -Wshadow -Wwrite-strings -Wuninitialized -Wall -pipe -mtune=native -march=native -fomit-frame-pointer -msse2 -msse -mmmx -mfpmath=sse -D_FORTIFY_SOURCE=2 -Wpointer-arith -Wstrict-prototypes -fstack-protector -Wstack-protector -Wextra -Wbad-function-cast -Wcast-align -Wcast-qual -Wdisabled-optimization -Wendif-labels -Wfloat-equal -Wformat-nonliteral -Winline -Wmissing-declarations -Wmissing-prototypes -Wnested-externs -Wpointer-arith -Wundef -Wformat-security -ftree-vectorize -fsanitize=bounds" -Duseithreads
X -         -Acc=gcc-5 -Duseithreads
c -         -Aldflags="-fsanitize=bounds" -Duseithreads
| +--------- -DDEBUGGING
+----------- no debugging


Locally applied patches:
    SMOKE5875c53b4ef8c948011dc6f4e7e4ae4e6effd6aa

Failures: (common-args) none
[default] -Acc=gcc-5 -Duseithreads
Inconsistent test results (between TEST and harness):
    ../t/op/magic.t.........................FAILED at test 41
    ../t/cpan/HTTP-Tiny/t/001_api.t.........FAILED--expected 2 tests, saw 0
    ../t/cpan/HTTP-Tiny/t/060_http_date.t...FAILED--no leader found
    ../t/cpan/HTTP-Tiny/t/030_response.t....FAILED--no leader found
    ../t/cpan/HTTP-Tiny/t/010_url.t.........FAILED--no leader found
    ../t/dist/autouse/t/autouse.t...........FAILED--expected 12 tests, saw 8
    ../t/cpan/HTTP-Tiny/t/110_mirror.t......FAILED--no leader found
    ../t/op/numconvert.t....................FAILED at test 104
    ../t/cpan/HTTP-Tiny/t/130_redirect.t....FAILED--no leader found
    ../t/cpan/HTTP-Tiny/t/020_headers.t.....FAILED--no leader found
    ../t/cpan/HTTP-Tiny/t/120_put.t.........FAILED--no leader found
    ../t/cpan/HTTP-Tiny/t/000_load.t........FAILED at test 1
    ../t/cpan/HTTP-Tiny/t/00-compile.t......FAILED at test 1
    ../t/cpan/HTTP-Tiny/t/050_chunked_body.tFAILED--no leader found
    ../t/dist/IO/t/io_multihomed.t..........FAILED--expected test 6, saw test 8
    ../t/cpan/HTTP-Tiny/t/100_get.t.........FAILED--no leader found
    ../t/cpan/HTTP-Tiny/t/002_croakage.t....FAILED--no leader found
    ../t/re/reg_namedcapture.t..............FAILED at test 2
    ../t/op/range.t.........................FAILED at test 84
    ../t/cpan/HTTP-Tiny/t/040_content.t.....FAILED--no leader found

Compiler messages(gcc):
try.c: In function ‘main’:
regcomp.c: In function ‘S_dump_trie’:
regcomp.h:839:40: warning: variable ‘re_debug_flags’ set but not used [-Wunused-but-set-variable]
regcomp.c: In function ‘S_dump_trie_interim_list’:
regcomp.c: In function ‘S_dump_trie_interim_table’:
toke.c: In function ‘Perl_yylex’:
toke.c:4796:17: warning: comparison between signed and unsigned integer expressions [-Wsign-compare]
regcomp.c: In function ‘Perl_re_compile’:
regcomp.c: In function ‘Perl_reg_named_buff_nextkey’:
hv.c: In function ‘S_hv_delete_common’:
hv.c:888:16: warning: variable ‘first_entry’ set but not used [-Wunused-but-set-variable]
hv.c: In function ‘S_clear_placeholders’:
hv.c:1600:7: warning: variable ‘first’ set but not used [-Wunused-but-set-variable]
hv.c: In function ‘S_unshare_hek_or_pvn’:
hv.c:2630:10: warning: variable ‘first’ set but not used [-Wunused-but-set-variable]
regcomp.c: In function ‘Perl_pregfree2’:
regcomp.c: In function ‘Perl_regdupe_internal’:
regcomp.c:11674:14: warning: variable ‘npar’ set but not used [-Wunused-but-set-variable]
pp_ctl.c: In function ‘Perl_pp_goto’:
pp_ctl.c:2702:7: warning: variable ‘gimme’ set but not used [-Wunused-but-set-variable]
pp_ctl.c:2701:8: warning: variable ‘newsp’ set but not used [-Wunused-but-set-variable]
pp_ctl.c: In function ‘Perl_pp_leavewhen’:
pp_ctl.c:4857:9: warning: variable ‘gimme’ set but not used [-Wunused-but-set-variable]
pp_sys.c: In function ‘Perl_pp_warn’:
pp_sys.c:422:17: warning: variable ‘pv’ set but not used [-Wunused-but-set-variable]
pp_sys.c: In function ‘Perl_pp_die’:
pp_sys.c:462:17: warning: variable ‘pv’ set but not used [-Wunused-but-set-variable]
regexec.c: In function ‘S_find_byclass’:
regexec.c:1394:9: warning: variable ‘lnc’ set but not used [-Wunused-but-set-variable]
regexec.c: In function ‘S_regmatch’:
regexec.c:130:39: warning: variable ‘throw_away’ set but not used [-Wunused-but-set-variable]
regcomp.c:4539:19: warning: variable ‘initial_charset’ might be clobbered by ‘longjmp’ or ‘vfork’ [-Wclobbered]
compress.c: In function ‘sendMTFValues’:
compress.c:243:19: warning: variable ‘nBytes’ set but not used [-Wunused-but-set-variable]
POSIX.o: In function `XS_POSIX_tmpnam':

-- 
Report by Test::Smoke v1.53 build 1374 running on perl 5.20.2
(Reporter v0.050 / Smoker v0.045)



nntp.perl.org: Perl Programming lists via nntp and http.
Comments to Ask Bjørn Hansen at ask@perl.org | Group listing | About