develooper Front page | perl.perl5.porters | Postings from May 2015

Smoke [5.10.1] perl-5.10.1-6-ge94431a FAIL(Xc) linux 3.16.0-4-amd64[debian] (x86_64/12 cpu)

From:
njh
Date:
May 6, 2015 08:29
Subject:
Smoke [5.10.1] perl-5.10.1-6-ge94431a FAIL(Xc) linux 3.16.0-4-amd64[debian] (x86_64/12 cpu)
Message ID:
201505060829.t468T7LT028022@compaq.bandsman.co.uk
Automated smoke report for 5.10.1 patch e94431af0ada74486afd65207f3e0345fe7485fe perl-5.10.1-6-ge94431a
cyberpower2: Intel(R) Core(TM) i7-4960X CPU @ 3.60GHz (GenuineIntel 1858MHz) (x86_64/12 cpu)
    on        linux - 3.16.0-4-amd64 [debian]
    using      gcc-5 version 5.1.1
    smoketime 4 minutes 59 seconds (average 1 minute 39.667 seconds)

Summary: FAIL(Xc)

O = OK  F = Failure(s), extended report at the bottom
X = Failure(s) under TEST but not under harness
? = still running or test results not (yet) available
Build failures during:       - = unknown or N/A
c = Configure, m = make, M = make (after miniperl), t = make test-prep

perl-5.10.1-6-ge94431a  Configuration (common) none
----------- ---------------------------------------------------------
c - - -     -Accflags="-O2 -W -Wformat=2 -Wswitch -Wshadow -Wwrite-strings -Wuninitialized -Wall -pipe -mtune=native -march=native -fomit-frame-pointer -msse2 -msse -mmmx -mfpmath=sse -D_FORTIFY_SOURCE=2 -Wpointer-arith -Wstrict-prototypes -fstack-protector -Wstack-protector -Wextra -Wbad-function-cast -Wcast-align -Wcast-qual -Wdisabled-optimization -Wendif-labels -Wfloat-equal -Wformat-nonliteral -Winline -Wmissing-declarations -Wmissing-prototypes -Wnested-externs -Wpointer-arith -Wundef -Wformat-security -ftree-vectorize -fsanitize=bounds" -Duseithreads
X X - -     -Acc=gcc-5 -Duseithreads
c - - -     -Aldflags="-fsanitize=bounds" -Duseithreads
| | | +----- PERLIO = perlio -DDEBUGGING
| | +------- PERLIO = stdio  -DDEBUGGING
| +--------- PERLIO = perlio
+----------- PERLIO = stdio


Locally applied patches:
    SMOKEe94431af0ada74486afd65207f3e0345fe7485fe

Failures: (common-args) none
[stdio] -Acc=gcc-5 -Duseithreads
Inconsistent test results (between TEST and harness):
    ../t/op/magic.t.........................FAILED at test 45
    ../t/op/numconvert.t....................FAILED at test 104
    ../t/op/reg_namedcapture.t..............FAILED at test 2
    ../t/comp/cpp.t.........................FAILED--no leader found
    ../t/run/switchPx.t.....................FAILED--no leader found
    ../t/op/pat.t...........................FAILED at test 1063
    ../t/op/pat_thr.t.......................FAILED at test 1063
    ../t/op/range.t.........................FAILED at test 84

[perlio] -Acc=gcc-5 -Duseithreads
Inconsistent test results (between TEST and harness):
    ../t/op/pat_thr.t.......................FAILED at test 1063
    ../t/op/pat.t...........................FAILED at test 1063
    ../t/op/range.t.........................FAILED at test 84
    ../t/run/switchPx.t.....................FAILED--no leader found
    ../t/comp/cpp.t.........................FAILED--no leader found
    ../t/op/reg_namedcapture.t..............FAILED at test 2
    ../t/op/numconvert.t....................FAILED at test 104
    ../t/op/magic.t.........................FAILED at test 45

Compiler messages(gcc):
try.c: In function ‘main’:
hv.c: In function ‘Perl_hv_common’:
hv.c:39:48: warning: comparison between signed and unsigned integer expressions [-Wsign-compare]
regcomp.c: In function ‘S_dump_trie’:
regcomp.h:801:36: warning: variable ‘re_debug_flags’ set but not used [-Wunused-but-set-variable]
regcomp.c: In function ‘S_dump_trie_interim_list’:
regcomp.c: In function ‘S_dump_trie_interim_table’:
hv.c: In function ‘S_share_hek_flags’:
regcomp.c: In function ‘Perl_re_compile’:
regcomp.c: In function ‘Perl_reg_named_buff_nextkey’:
regcomp.c: In function ‘Perl_pregfree’:
regcomp.c: In function ‘Perl_regdupe_internal’:
regcomp.c:9678:14: warning: variable ‘npar’ set but not used [-Wunused-but-set-variable]
pp.c: In function ‘Perl_pp_not’:
pp.c:2473:31: warning: identifier "not" is a special operator name in C++ [-Wc++-compat]
pp.c: In function ‘Perl_pp_complement’:
pp.c:2480:37: warning: identifier "compl" is a special operator name in C++ [-Wc++-compat]
pp_sys.c: In function ‘Perl_pp_getpriority’:
pp_sys.c:4332:23: warning: enum conversion when passing argument 1 of ‘getpriority’ is invalid in C++ [-Wc++-compat]
pp_sys.c: In function ‘Perl_pp_setpriority’:
pp_sys.c:4347:23: warning: enum conversion when passing argument 1 of ‘setpriority’ is invalid in C++ [-Wc++-compat]
pp_ctl.c: In function ‘Perl_pp_goto’:
pp_ctl.c:2452:7: warning: variable ‘gimme’ set but not used [-Wunused-but-set-variable]
pp_ctl.c:2451:8: warning: variable ‘newsp’ set but not used [-Wunused-but-set-variable]
pp_ctl.c: In function ‘Perl_pp_leavegiven’:
pp_ctl.c:3888:9: warning: variable ‘gimme’ set but not used [-Wunused-but-set-variable]
pp_ctl.c: In function ‘Perl_pp_leavewhen’:
pp_ctl.c:4436:9: warning: variable ‘gimme’ set but not used [-Wunused-but-set-variable]
regexec.c: In function ‘S_regtry’:
regexp.h:427:53: warning: right-hand operand of comma expression has no effect [-Wunused-value]
regexec.c: In function ‘S_regmatch’:
regcomp.c: In function ‘S_reg_namedseq’:
perlio.c: In function ‘PerlIOBuf_get_base’:
perlio.c:4126:9: warning: operation on ‘b->buf’ may be undefined [-Wsequence-point]
compress.c: In function ‘sendMTFValues’:
compress.c:243:19: warning: variable ‘nBytes’ set but not used [-Wunused-but-set-variable]
POSIX.o: In function `XS_POSIX_tmpnam':
re_comp.c: In function ‘S_reg_namedseq’:

-- 
Report by Test::Smoke v1.53 build 1374 running on perl 5.20.2
(Reporter v0.050 / Smoker v0.045)



nntp.perl.org: Perl Programming lists via nntp and http.
Comments to Ask Bjørn Hansen at ask@perl.org | Group listing | About