develooper Front page | perl.perl5.porters | Postings from May 2015

Smoke [5.16.3] v5.16.3-9-g7aa08a0 FAIL(Xc) linux 3.16.0-4-amd64[debian] (x86_64/12 cpu)

From:
njh
Date:
May 6, 2015 04:36
Subject:
Smoke [5.16.3] v5.16.3-9-g7aa08a0 FAIL(Xc) linux 3.16.0-4-amd64[debian] (x86_64/12 cpu)
Message ID:
201505060435.t464Zn3V001582@compaq.bandsman.co.uk
Automated smoke report for 5.16.3 patch 7aa08a0f356a87b817f92a7941678ccf0e162b90 v5.16.3-9-g7aa08a0
cyberpower2: Intel(R) Core(TM) i7-4960X CPU @ 3.60GHz (GenuineIntel 1581MHz) (x86_64/12 cpu)
    on        linux - 3.16.0-4-amd64 [debian]
    using      gcc-5 version 5.1.1
    smoketime 11 minutes 40 seconds (average 3 minutes 53.333 seconds)

Summary: FAIL(Xc)

O = OK  F = Failure(s), extended report at the bottom
X = Failure(s) under TEST but not under harness
? = still running or test results not (yet) available
Build failures during:       - = unknown or N/A
c = Configure, m = make, M = make (after miniperl), t = make test-prep

v5.16.3-9-g7aa08a0  Configuration (common) none
----------- ---------------------------------------------------------
c -         -Accflags="-O2 -W -Wformat=2 -Wswitch -Wshadow -Wwrite-strings -Wuninitialized -Wall -pipe -mtune=native -march=native -fomit-frame-pointer -msse2 -msse -mmmx -mfpmath=sse -D_FORTIFY_SOURCE=2 -Wpointer-arith -Wstrict-prototypes -fstack-protector -Wstack-protector -Wextra -Wbad-function-cast -Wcast-align -Wcast-qual -Wdisabled-optimization -Wendif-labels -Wfloat-equal -Wformat-nonliteral -Winline -Wmissing-declarations -Wmissing-prototypes -Wnested-externs -Wpointer-arith -Wundef -Wformat-security -ftree-vectorize -fsanitize=bounds" -Duseithreads
X -         -Acc=gcc-5 -Duseithreads
c -         -Aldflags="-fsanitize=bounds" -Duseithreads
| +--------- -DDEBUGGING
+----------- no debugging


Locally applied patches:
    SMOKE7aa08a0f356a87b817f92a7941678ccf0e162b90

Failures: (common-args) none
[default] -Acc=gcc-5 -Duseithreads
Inconsistent test results (between TEST and harness):
    ../t/cpan/HTTP-Tiny/t/104_post.t........ ..................................... FAILED--no leader found
    ../t/cpan/HTTP-Tiny/t/140_proxy.t....... .................................... FAILED--no leader found
    ../t/op/magic.t......................... .................................................... FAILED at test 104
    ../t/cpan/HTTP-Tiny/t/130_redirect.t.... ................................. FAILED--no leader found
    ../t/cpan/HTTP-Tiny/t/00-compile.t...... ................................... FAILED at test 1
    ../t/cpan/HTTP-Tiny/t/010_url.t......... ...................................... FAILED--no leader found
    ../t/cpan/HTTP-Tiny/t/000_load.t........ ..................................... FAILED at test 1
    ../t/cpan/HTTP-Tiny/t/020_headers.t..... .................................. FAILED--no leader found
    ../t/cpan/HTTP-Tiny/t/002_croakage.t.... ................................. FAILED--no leader found
    ../t/re/reg_namedcapture.t.............. ......................................... FAILED at test 2
    ../t/dist/IO/t/io_multihomed.t.......... ....................................... FAILED--expected test 6, saw test 8
    ../t/op/numconvert.t.................... ............................................... FAILED at test 104
    ../t/cpan/HTTP-Tiny/t/102_put.t......... ...................................... FAILED--no leader found
    ../t/cpan/Socket/t/socketpair.t......... ...................................... FAILED at test 14
    ../t/dist/autouse/t/autouse.t........... ........................................ FAILED--expected 15 tests, saw 8
    ../t/cpan/HTTP-Tiny/t/040_content.t..... .................................. FAILED--no leader found
    ../t/cpan/HTTP-Tiny/t/100_get.t......... ...................................... FAILED--no leader found
    ../t/op/range.t......................... .................................................... FAILED at test 84
    ../t/cpan/HTTP-Tiny/t/001_api.t......... ...................................... FAILED--expected 2 tests, saw 0
    ../t/cpan/HTTP-Tiny/t/030_response.t.... ................................. FAILED--no leader found
    ../t/cpan/HTTP-Tiny/t/101_head.t........ ..................................... FAILED--no leader found
    ../t/cpan/HTTP-Tiny/t/050_chunked_body.t ............................. FAILED--no leader found
    ../t/cpan/HTTP-Tiny/t/060_http_date.t... ................................ FAILED--no leader found
    ../t/cpan/HTTP-Tiny/t/110_mirror.t...... ................................... FAILED--no leader found
    ../t/cpan/HTTP-Tiny/t/150_post_form.t... ................................ FAILED--no leader found
    ../t/cpan/HTTP-Tiny/t/103_delete.t...... ................................... FAILED--no leader found

Compiler messages(gcc):
try.c: In function ‘main’:
try.c:22:14: error: ‘KERN_PROC’ undeclared (first use in this function)
try.c:23:14: error: ‘KERN_PROC_PATHNAME’ undeclared (first use in this function)
regcomp.c: In function ‘S_regclass’:
regcomp.c:10690:50: warning: comparison of constant ‘12’ with boolean expression is always false [-Wbool-compare]
regcomp.c:10690:50: warning: logical not is only applied to the left hand side of comparison [-Wlogical-not-parentheses]
regcomp.c:393:36: warning: ignoring return value of ‘get_regex_charset’, declared with attribute warn_unused_result [-Wunused-result]
regcomp.c: In function ‘Perl_re_compile’:
regcomp.c:4886:19: warning: variable ‘initial_charset’ might be clobbered by ‘longjmp’ or ‘vfork’ [-Wclobbered]
compress.c: In function ‘sendMTFValues’:
compress.c:243:19: warning: variable ‘nBytes’ set but not used [-Wunused-but-set-variable]
POSIX.o: In function `XS_POSIX_tmpnam':
re_comp.c: In function ‘S_regclass’:
re_comp.c:393:36: warning: ignoring return value of ‘get_regex_charset’, declared with attribute warn_unused_result [-Wunused-result]

-- 
Report by Test::Smoke v1.53 build 1374 running on perl 5.20.2
(Reporter v0.050 / Smoker v0.045)



nntp.perl.org: Perl Programming lists via nntp and http.
Comments to Ask Bjørn Hansen at ask@perl.org | Group listing | About