develooper Front page | perl.perl5.porters | Postings from May 2015

Smoke [5.20.2] v5.20.2-1-gd8fb165 FAIL(Xc) linux 3.16.0-4-amd64[debian] (x86_64/12 cpu)

From:
njh
Date:
May 6, 2015 02:36
Subject:
Smoke [5.20.2] v5.20.2-1-gd8fb165 FAIL(Xc) linux 3.16.0-4-amd64[debian] (x86_64/12 cpu)
Message ID:
201505060236.t462aFcF022661@compaq.bandsman.co.uk
Automated smoke report for 5.20.2 patch d8fb1650dba2e6ec20359fcc9c0c5adaf9b68a33 v5.20.2-1-gd8fb165
cyberpower2: Intel(R) Core(TM) i7-4960X CPU @ 3.60GHz (GenuineIntel 3600MHz) (x86_64/12 cpu)
    on        linux - 3.16.0-4-amd64 [debian]
    using      gcc-5 version 5.1.1
    smoketime 12 minutes 3 seconds (average 4 minutes 1 seconds)

Summary: FAIL(Xc)

O = OK  F = Failure(s), extended report at the bottom
X = Failure(s) under TEST but not under harness
? = still running or test results not (yet) available
Build failures during:       - = unknown or N/A
c = Configure, m = make, M = make (after miniperl), t = make test-prep

v5.20.2-1-gd8fb165  Configuration (common) none
----------- ---------------------------------------------------------
c -         -Accflags="-O2 -W -Wformat=2 -Wswitch -Wshadow -Wwrite-strings -Wuninitialized -Wall -pipe -mtune=native -march=native -fomit-frame-pointer -msse2 -msse -mmmx -mfpmath=sse -D_FORTIFY_SOURCE=2 -Wpointer-arith -Wstrict-prototypes -fstack-protector -Wstack-protector -Wextra -Wbad-function-cast -Wcast-align -Wcast-qual -Wdisabled-optimization -Wendif-labels -Wfloat-equal -Wformat-nonliteral -Winline -Wmissing-declarations -Wmissing-prototypes -Wnested-externs -Wpointer-arith -Wundef -Wformat-security -ftree-vectorize -fsanitize=bounds" -Duseithreads
X -         -Acc=gcc-5 -Duseithreads
c -         -Aldflags="-fsanitize=bounds" -Duseithreads
| +--------- -DDEBUGGING
+----------- no debugging


Locally applied patches:
    SMOKEd8fb1650dba2e6ec20359fcc9c0c5adaf9b68a33

Failures: (common-args) none
[default] -Acc=gcc-5 -Duseithreads
Inconsistent test results (between TEST and harness):
    ../t/dist/IO/t/IO.t..................... .................................................. FAILED--expected 18 tests, saw 4
    ../t/cpan/IO-Socket-IP/t/19no-addrs.t... ................................ FAILED--no leader found
    ../t/cpan/IO-Socket-IP/t/13addrinfo.t... ................................ FAILED--no leader found
    ../t/cpan/IO-Socket-IP/t/31nonblocking-connect-internet.t ............ FAILED--no leader found
    ../t/cpan/IO-Socket-IP/t/15io-socket.t.. ............................... FAILED--no leader found
    ../t/cpan/HTTP-Tiny/t/070_cookie_jar.t.. ............................... FAILED--expected 4 tests, saw 0
    ../t/cpan/IO-Socket-IP/t/06local-cross-v6.t .......................... FAILED--no leader found
    ../t/cpan/IO-Socket-IP/t/02local-server-v4.t ......................... FAILED--no leader found
    ../t/cpan/HTTP-Tiny/t/030_response.t.... ................................. FAILED--no leader found
    ../t/cpan/HTTP-Tiny/t/010_url.t......... ...................................... FAILED--no leader found
    ../t/cpan/HTTP-Tiny/t/141_no_proxy.t.... ................................. FAILED--no leader found
    ../t/cpan/HTTP-Tiny/t/050_chunked_body.t ............................. FAILED--no leader found
    ../t/cpan/IO-Socket-IP/t/05local-server-v6.t ......................... FAILED--no leader found
    ../t/cpan/HTTP-Tiny/t/002_croakage.t.... ................................. FAILED--no leader found
    ../t/dist/IO/t/cachepropagate-udp.t..... .................................. FAILED--no leader found
    ../t/cpan/libnet/t/nntp.t............... ............................................ FAILED--no leader found
    ../t/cpan/HTTP-Tiny/t/001_api.t......... ...................................... FAILED--expected 2 tests, saw 0
    ../t/cpan/IO-Socket-IP/t/21as-inet.t.... ................................. FAILED--no leader found
    ../t/cpan/Socket/t/socketpair.t......... ...................................... FAILED at test 14
    ../t/cpan/HTTP-Tiny/t/150_post_form.t... ................................ FAILED--no leader found
    ../t/cpan/IO-Socket-IP/t/00use.t........ ..................................... FAILED at test 1
    ../t/cpan/HTTP-Tiny/t/162_proxy_auth.t.. ............................... FAILED--no leader found
    ../t/cpan/IO-Socket-IP/t/30nonblocking-connect.t ..................... FAILED--no leader found
    ../ext/B/t/concise-xs.t................. ............................................ FAILED at test 965
    ../t/cpan/libnet/t/require.t............ ......................................... FAILED at test 5
    ../t/cpan/HTTP-Tiny/t/130_redirect.t.... ................................. FAILED--no leader found
    ../t/dist/autouse/t/autouse.t........... ........................................ FAILED--expected 15 tests, saw 8
    ../t/io/open.t.......................... ..................................................... FAILED--no leader found
    ../t/re/reg_namedcapture.t.............. ......................................... FAILED at test 2
    ../t/dist/IO/t/cachepropagate-unix.t.... ................................. FAILED--no leader found
    ../t/dist/IO/t/io_multihomed.t.......... ....................................... FAILED--no leader found
    ../t/cpan/IO-Socket-IP/t/17gai-flags.t.. ............................... FAILED--no leader found
    ../t/cpan/IO-Socket-IP/t/10args.t....... .................................... FAILED--no leader found
    ../t/cpan/IO-Socket-IP/t/12port-fallback.t ........................... FAILED--no leader found
    ../t/cpan/IO-Socket-IP/t/01local-client-v4.t ......................... FAILED--no leader found
    ../t/cpan/HTTP-Tiny/t/101_head.t........ ..................................... FAILED--no leader found
    ../t/cpan/IO-Socket-IP/t/04local-client-v6.t ......................... FAILED--no leader found
    ../t/cpan/HTTP-Tiny/t/100_get.t......... ...................................... FAILED--no leader found
    ../t/cpan/libnet/t/smtp.t............... ............................................ FAILED--no leader found
    ../t/cpan/HTTP-Tiny/t/000_load.t........ ..................................... FAILED at test 1
    ../t/cpan/IO-Socket-IP/t/14fileno.t..... .................................. FAILED--no leader found
    ../t/cpan/HTTP-Tiny/t/102_put.t......... ...................................... FAILED--no leader found
    ../t/cpan/HTTP-Tiny/t/020_headers.t..... .................................. FAILED--no leader found
    ../t/cpan/HTTP-Tiny/t/140_proxy.t....... .................................... FAILED--no leader found
    ../t/op/magic.t......................... .................................................... FAILED at test 107
    ../t/dist/IO/t/cachepropagate-tcp.t..... .................................. FAILED--no leader found
    ../t/cpan/HTTP-Tiny/t/110_mirror.t...... ................................... FAILED--no leader found
    ../t/dist/IO/t/io_unix.t................ ............................................. FAILED--no leader found
    ../t/cpan/File-Fetch/t/01_File-Fetch.t.. ............................... FAILED--non-zero wait status: 65280
    ../t/dist/IO/t/io_sel.t................. .............................................. FAILED--expected 27 tests, saw 23
    ../t/cpan/HTTP-Tiny/t/040_content.t..... .................................. FAILED--no leader found
    ../t/cpan/HTTP-Tiny/t/170_keepalive.t... ................................ FAILED--no leader found
    ../t/run/switches.t..................... ................................................ FAILED--no leader found
    ../t/cpan/HTTP-Tiny/t/060_http_date.t... ................................ FAILED--no leader found
    ../t/cpan/IO-Socket-IP/t/03local-cross-v4.t .......................... FAILED--no leader found
    ../t/io/fs.t............................ ....................................................... FAILED--expected 55 tests, saw 53
    ../t/cpan/IO-Socket-IP/t/16v6only.t..... .................................. FAILED--no leader found
    ../t/cpan/HTTP-Tiny/t/161_basic_auth.t.. ............................... FAILED--no leader found
    ../t/dist/IO/t/io_sock.t................ ............................................. FAILED--no leader found
    ../t/cpan/HTTP-Tiny/t/160_cookies.t..... .................................. FAILED--no leader found
    ../t/cpan/IO-Socket-IP/t/11sockopts.t... ................................ FAILED--no leader found
    ../t/cpan/IO-Socket-IP/t/18fdopen.t..... .................................. FAILED--no leader found
    ../t/lib/1_compile.t.................... ............................................... FAILED at test 3
    ../t/cpan/HTTP-Tiny/t/003_agent.t....... .................................... FAILED--expected 8 tests, saw 0
    ../t/dist/IO/t/io_udp.t................. .............................................. FAILED--no leader found
    ../t/cpan/HTTP-Tiny/t/103_delete.t...... ................................... FAILED--no leader found
    ../t/cpan/IO-Socket-IP/t/20subclass.t... ................................ FAILED--no leader found
    ../t/cpan/libnet/t/ftp.t................ ............................................. FAILED--no leader found
    ../t/cpan/HTTP-Tiny/t/104_post.t........ ..................................... FAILED--no leader found

Compiler messages(gcc):
make ...op.c: In function ‘Perl_pmruntime’:
op.c:4943:14: warning: comparison between signed and unsigned integer expressions [-Wsign-compare]
pp.c: In function ‘Perl_pp_undef’:
hv.h:450:39: warning: right-hand operand of comma expression has no effect [-Wunused-value]
scope.c: In function ‘Perl_leave_scope’:
op.c: In function ‘Perl_pmruntime’:
compress.c: In function ‘sendMTFValues’:
compress.c:243:19: warning: variable ‘nBytes’ set but not used [-Wunused-but-set-variable]
POSIX.o: In function `XS_POSIX_tmpnam':

-- 
Report by Test::Smoke v1.53 build 1374 running on perl 5.20.2
(Reporter v0.050 / Smoker v0.045)



nntp.perl.org: Perl Programming lists via nntp and http.
Comments to Ask Bjørn Hansen at ask@perl.org | Group listing | About