develooper Front page | perl.perl5.porters | Postings from February 2015

Smoke [ebcdic] v5.21.8-473-g1437e3d FAIL(X) os/390 23.00 (2817/)

From:
Yaroslav Kuzmin
Date:
February 12, 2015 07:43
Subject:
Smoke [ebcdic] v5.21.8-473-g1437e3d FAIL(X) os/390 23.00 (2817/)
Message ID:
e9482b65bf6345ad94cbef57e9a70b82@wal-s-mbx2.rocketsoftware.com
Smoke logs available at  https://drive.google.com/file/d/0B5PTttxwo7qANm5DUzVCRjlIQmc


Automated smoke report for branch ebcdic 5.21.9 patch 1437e3d8b7eb76d78d6ebfd9989c6c198e871f26 v5.21.8-473-g1437e3d
RS12: 2817 (2817/)
    on        os/390 - 23.00
    using     c99 version
    smoketime 5 hours 38 minutes (average 2 hours 49 minutes)

Summary: FAIL(X)

O = OK  F = Failure(s), extended report at the bottom
X = Failure(s) under TEST but not under harness
? = still running or test results not (yet) available
Build failures during:       - = unknown or N/A
c = Configure, m = make, M = make (after miniperl), t = make test-prep

v5.21.8-473-g1437e3d  Configuration (common) none
----------- ---------------------------------------------------------
X X X X
| | | +----- PERLIO = perlio -DDEBUGGING
| | +------- PERLIO = stdio  -DDEBUGGING
| +--------- PERLIO = perlio
+----------- PERLIO = stdio


Locally applied patches:
    SMOKE1437e3d8b7eb76d78d6ebfd9989c6c198e871f26

Tests skipped on user request:
    # One test name on a line
Failures: (common-args) none
[stdio]
Inconsistent test results (between TEST and harness):
    ../t/op/stat.t.......................... ..................................................... FAILED at test 2
    ../t/op/pack.t.......................... ..................................................... FAILED at test 4174
    ../lib/DBM_Filter/t/encode.t............ ....................................... FAILED at test 25
    ../lib/open.t........................... ...................................................... FAILED at test 24
    ../t/dist/Data-Dumper/t/dumper.t........ ..................................... FAILED at test 322
    ../t/porting/readme.t................... .............................................. FAILED at test 70
    ../ext/POSIX/t/sigaction.t.............. ......................................... FAILED--expected 33 tests, saw 30

[perlio]
Inconsistent test results (between TEST and harness):
    ../t/porting/readme.t................... .............................................. FAILED at test 70
    ../ext/POSIX/t/sigaction.t.............. ......................................... FAILED--expected 33 tests, saw 30
    ../lib/open.t........................... ...................................................... FAILED at test 24
    ../t/dist/Data-Dumper/t/dumper.t........ ..................................... FAILED at test 322
    ../t/op/pack.t.......................... ..................................................... FAILED at test 4174
    ../lib/DBM_Filter/t/encode.t............ ....................................... FAILED at test 25
    ../t/op/stat.t.......................... ..................................................... FAILED at test 2

[stdio] -DDEBUGGING
Inconsistent test results (between TEST and harness):
    ../t/porting/readme.t................... .............................................. FAILED at test 70
    ../ext/POSIX/t/sigaction.t.............. ......................................... FAILED--expected 33 tests, saw 30
    ../t/dist/Data-Dumper/t/dumper.t........ ..................................... FAILED at test 322
    ../lib/open.t........................... ...................................................... FAILED at test 24
    ../lib/DBM_Filter/t/encode.t............ ....................................... FAILED at test 25
    ../t/op/pack.t.......................... ..................................................... FAILED at test 4174
    ../t/op/stat.t.......................... ..................................................... FAILED at test 2

[perlio] -DDEBUGGING
Inconsistent test results (between TEST and harness):
    ../t/op/pack.t.......................... ..................................................... FAILED at test 4174
    ../lib/DBM_Filter/t/encode.t............ ....................................... FAILED at test 25
    ../t/op/stat.t.......................... ..................................................... FAILED at test 2
    ../ext/POSIX/t/sigaction.t.............. ......................................... FAILED--expected 33 tests, saw 30
    ../t/porting/readme.t................... .............................................. FAILED at test 70
    ../lib/open.t........................... ...................................................... FAILED at test 24
    ../t/dist/Data-Dumper/t/dumper.t........ ..................................... FAILED at test 322

Compiler messages(os390):



--
Report by Test::Smoke v1.6 running on perl 5.21.7
(Reporter v0.052 / Smoker v0.045)


------------------------------------------------------------------------
 Yaroslav Kuzmin
Developer C/C++ ,z/OS , Linux
3 Zhukovskiy Street · Miass, Chelyabinsk region 456318 · Russia
Tel:  +7.922.2.38.33.38
Email: YKuzmin@rocketsoftware.com
Web: www.rocketsoftware.com
================================
Rocket Software, Inc. and subsidiaries ■ 77 Fourth Avenue, Waltham MA 02451 ■ +1 800.966.3270 ■ +1 781.577.4321
Unsubscribe From Commercial Email – unsubscribe@rocketsoftware.com
Manage Your Subscription Preferences - http://info.rocketsoftware.com/GlobalSubscriptionManagementEmailFooter_SubscriptionCenter.html
Privacy Policy - http://www.rocketsoftware.com/company/legal/privacy-policy
================================

This communication and any attachments may contain confidential information of Rocket Software, Inc. All unauthorized use, disclosure or distribution is prohibited. If you are not the intended recipient, please notify Rocket Software immediately and destroy all copies of this communication. Thank you.



nntp.perl.org: Perl Programming lists via nntp and http.
Comments to Ask Bjørn Hansen at ask@perl.org | Group listing | About