develooper Front page | perl.perl5.porters | Postings from February 2015

Some os390 messages to investigate

From:
Karl Williamson
Date:
February 11, 2015 06:20
Subject:
Some os390 messages to investigate
Message ID:
54DAF493.2000508@khwilliamson.com
On 02/10/2015 12:51 AM, Yaroslav Kuzmin wrote:
>
> Smoke logs available at https://drive.google.com/file/d/0B5PTttxwo7qAdkVaT2x0RUlkRm8
>

These warning messages come out consistently, but no tests actually 
fail.  I'm wondering what should be done about these, if anything?


dist/Exporter/t/warn .......................................... ok
FSUM3212 c99: Command option -x is incorrect for z/OS platform - ignored.
FSUM3228 c99: Input file c++ not found.
CCN0461(W) "EXTC89" is not a valid sub-option for "LANGLVL". Option is 
ignored.
CCN0461(W) "EXTC99" is not a valid sub-option for "LANGLVL". Option is 
ignored.
CCN8101(W) The numeric value "3296" specified in 
"report(treatAsError,3296)" is out of bounds. The option is ignored.
CCN8101(W) The numeric value "4108" specified in 
"report(treatAsError,4108)" is out of bounds. The option is ignored.
dist/ExtUtils-CBuilder/t/00-have-compiler ..................... ok
  IEW2457E 9208 SYMBOL CEESG003 UNRESOLVED.  NO CALL LIBRARY SPECIFIED. 

  IEW2457E 9208 SYMBOL CEESTART UNRESOLVED.  NO CALL LIBRARY SPECIFIED. 

  IEW2665S 40FF MODULE *NULL*  IS NON-EXECUTABLE AND WAS NOT SAVED 
BECAUSE
           STORENX=NEVER. 

IEW5033 The binder ended with return code 12.
dist/ExtUtils-CBuilder/t/01-basic ............................. skipped
  IEW2457E 9208 SYMBOL CEESG003 UNRESOLVED.  NO CALL LIBRARY SPECIFIED. 

  IEW2457E 9208 SYMBOL CEESTART UNRESOLVED.  NO CALL LIBRARY SPECIFIED. 

  IEW2665S 40FF MODULE *NULL*  IS NON-EXECUTABLE AND WAS NOT SAVED 
BECAUSE
           STORENX=NEVER. 

IEW5033 The binder ended with return code 12.
dist/ExtUtils-CBuilder/t/02-link .............................. skipped
FSUM3212 c99: Command option -x is incorrect for z/OS platform - ignored.
FSUM3228 c99: Input file c++ not found.
CCN0461(W) "EXTC89" is not a valid sub-option for "LANGLVL". Option is 
ignored.
CCN0461(W) "EXTC99" is not a valid sub-option for "LANGLVL". Option is 
ignored.
CCN8101(W) The numeric value "3296" specified in 
"report(treatAsError,3296)" is out of bounds. The option is ignored.
CCN8101(W) The numeric value "4108" specified in 
"report(treatAsError,4108)" is out of bounds. The option is ignored.
dist/ExtUtils-CBuilder/t/03-cplusplus ......................... skipped
t/04-base.t: 270: 
rv='/RS12/tmp/HIizIhBo4z/alpha/beta/gamma/delta/epsilon/zeta/eta/theta/iota/kappa/lambda'; 
rp='/tmp/HIizIhBo4z/alpha/beta/gamma/delta/epsilon/zeta/eta/theta/iota/kappa/lambda'; 
subdir='/tmp/HIizIhBo4z/alpha/beta/gamma/delta/epsilon/zeta/eta/theta/iota/kappa/lambda'
dist/ExtUtils-CBuilder/t/04-base .............................. ok
  IEW2457E 9208 SYMBOL CEESG003 UNRESOLVED.  NO CALL LIBRARY SPECIFIED. 

  IEW2457E 9208 SYMBOL CEESTART UNRESOLVED.  NO CALL LIBRARY SPECIFIED. 

  IEW2665S 40FF MODULE *NULL*  IS NON-EXECUTABLE AND WAS NOT SAVED 
BECAUSE
           STORENX=NEVER. 

IEW5033 The binder ended with return code 12.
dist/ExtUtils-ParseXS/t/001-basic ............................. ok
  IEW2457E 9208 SYMBOL CEESG003 UNRESOLVED.  NO CALL LIBRARY SPECIFIED. 

  IEW2457E 9208 SYMBOL CEESTART UNRESOLVED.  NO CALL LIBRARY SPECIFIED. 

  IEW2665S 40FF MODULE *NULL*  IS NON-EXECUTABLE AND WAS NOT SAVED 
BECAUSE
           STORENX=NEVER. 

IEW5033 The binder ended with return code 12.
dist/ExtUtils-ParseXS/t/002-more .............................. ok
  IEW2457E 9208 SYMBOL CEESG003 UNRESOLVED.  NO CALL LIBRARY SPECIFIED. 

  IEW2457E 9208 SYMBOL CEESTART UNRESOLVED.  NO CALL LIBRARY SPECIFIED. 

  IEW2665S 40FF MODULE *NULL*  IS NON-EXECUTABLE AND WAS NOT SAVED 
BECAUSE
           STORENX=NEVER. 


> Automated smoke report for branch ebcdic 5.21.9 patch 1d5610101a4f47a5274c8a0bb5af39039788eb49 v5.21.8-436-g1d56101
> RS12: 2817 (2817/)
>      on        os/390 - 23.00
>      using     c99 version
>      smoketime 4 hours 50 minutes (average 2 hours 25 minutes)
>
> Summary: FAIL(X)
>
> O = OK  F = Failure(s), extended report at the bottom
> X = Failure(s) under TEST but not under harness
> ? = still running or test results not (yet) available
> Build failures during:       - = unknown or N/A
> c = Configure, m = make, M = make (after miniperl), t = make test-prep
>
> v5.21.8-436-g1d56101  Configuration (common) none
> ----------- ---------------------------------------------------------
> X X X X
> | | | +----- PERLIO = perlio -DDEBUGGING
> | | +------- PERLIO = stdio  -DDEBUGGING
> | +--------- PERLIO = perlio
> +----------- PERLIO = stdio
>
>
> Locally applied patches:
>      SMOKE1d5610101a4f47a5274c8a0bb5af39039788eb49
>
> Tests skipped on user request:
>      # One test name on a line
> Failures: (common-args) none
> [stdio]
> Inconsistent test results (between TEST and harness):
>      ../t/dist/Data-Dumper/t/dumper.t........ ..................................... FAILED at test 379
>      ../ext/POSIX/t/sigaction.t.............. ......................................... FAILED--expected 33 tests, saw 30
>      ../t/op/stat.t.......................... ..................................................... FAILED at test 2
>      ../lib/open.t........................... ...................................................... FAILED at test 24
>      ../t/porting/readme.t................... .............................................. FAILED at test 70
>      ../lib/DBM_Filter/t/encode.t............ ....................................... FAILED at test 25
>      ../t/op/pack.t.......................... ..................................................... FAILED at test 4174
>
> [perlio]
> Inconsistent test results (between TEST and harness):
>      ../t/porting/readme.t................... .............................................. FAILED at test 70
>      ../lib/open.t........................... ...................................................... FAILED at test 24
>      ../lib/DBM_Filter/t/encode.t............ ....................................... FAILED at test 25
>      ../t/op/pack.t.......................... ..................................................... FAILED at test 4174
>      ../t/dist/Data-Dumper/t/dumper.t........ ..................................... FAILED at test 379
>      ../ext/POSIX/t/sigaction.t.............. ......................................... FAILED--expected 33 tests, saw 30
>      ../t/op/stat.t.......................... ..................................................... FAILED at test 2
>
> [stdio] -DDEBUGGING
> Inconsistent test results (between TEST and harness):
>      ../lib/DBM_Filter/t/encode.t............ ....................................... FAILED at test 25
>      ../t/op/pack.t.......................... ..................................................... FAILED at test 4174
>      ../lib/open.t........................... ...................................................... FAILED at test 24
>      ../t/porting/readme.t................... .............................................. FAILED at test 70
>      ../t/op/stat.t.......................... ..................................................... FAILED at test 2
>      ../ext/POSIX/t/sigaction.t.............. ......................................... FAILED--expected 33 tests, saw 30
>      ../t/dist/Data-Dumper/t/dumper.t........ ..................................... FAILED at test 379
>
> [perlio] -DDEBUGGING
> Inconsistent test results (between TEST and harness):
>      ../t/dist/Data-Dumper/t/dumper.t........ ..................................... FAILED at test 379
>      ../ext/POSIX/t/sigaction.t.............. ......................................... FAILED--expected 33 tests, saw 30
>      ../t/op/stat.t.......................... ..................................................... FAILED at test 2
>      ../t/porting/readme.t................... .............................................. FAILED at test 70
>      ../lib/open.t........................... ...................................................... FAILED at test 24
>      ../t/op/pack.t.......................... ..................................................... FAILED at test 4174
>      ../lib/DBM_Filter/t/encode.t............ ....................................... FAILED at test 25
>
> Compiler messages(os390):
>
>
>
> --
> Report by Test::Smoke v1.6 running on perl 5.21.7
> (Reporter v0.052 / Smoker v0.045)
>
>
> ------------------------------------------------------------------------
>   Yaroslav Kuzmin
> Developer C/C++ ,z/OS , Linux
> 3 Zhukovskiy Street · Miass, Chelyabinsk region 456318 · Russia
> Tel:  +7.922.2.38.33.38
> Email: YKuzmin@rocketsoftware.com
> Web: www.rocketsoftware.com
> ================================
> Rocket Software, Inc. and subsidiaries ■ 77 Fourth Avenue, Waltham MA 02451 ■ +1 800.966.3270 ■ +1 781.577.4321
> Unsubscribe From Commercial Email – unsubscribe@rocketsoftware.com
> Manage Your Subscription Preferences - http://info.rocketsoftware.com/GlobalSubscriptionManagementEmailFooter_SubscriptionCenter.html
> Privacy Policy - http://www.rocketsoftware.com/company/legal/privacy-policy
> ================================
>
> This communication and any attachments may contain confidential information of Rocket Software, Inc. All unauthorized use, disclosure or distribution is prohibited. If you are not the intended recipient, please notify Rocket Software immediately and destroy all copies of this communication. Thank you.
>




nntp.perl.org: Perl Programming lists via nntp and http.
Comments to Ask Bjørn Hansen at ask@perl.org | Group listing | About