develooper Front page | perl.perl5.porters | Postings from February 2015

Smoke [blead] v5.21.8-265-g9efda33 FAIL(Fm) linux 3.16.0-30-generic [debian] (x86_64/8 cpu) {blead_clang_quick_sanitize=address}

From:
George Greer
Date:
February 10, 2015 02:39
Subject:
Smoke [blead] v5.21.8-265-g9efda33 FAIL(Fm) linux 3.16.0-30-generic [debian] (x86_64/8 cpu) {blead_clang_quick_sanitize=address}
Message ID:
201502100239.t1A2d1Rs024082@m-l.org
Smoke logs available at http://m-l.org/~perl/smoke/perl/linux/blead_clang_quick_sanitize=address/log9efda33a86bb90e4838144d230a4fc3ae4d63d7d.log.gz

Automated smoke report for 5.21.9 patch 9efda33a86bb90e4838144d230a4fc3ae4d63d7d v5.21.8-265-g9efda33
zwei: Intel(R) Core(TM) i7 CPU 920 @ 2.67GHz (GenuineIntel 2668MHz) (x86_64/8 cpu)
    on        linux - 3.16.0-30-generic [debian]
    using     clang version 4.2.1 Compatible Ubuntu Clang 3.5.0 (tags/RELEASE_350/final)
    smoketime 2 hours 51 minutes (average 42 minutes 55 seconds)

Summary: FAIL(Fm)

O = OK  F = Failure(s), extended report at the bottom
X = Failure(s) under TEST but not under harness
? = still running or test results not (yet) available
Build failures during:       - = unknown or N/A
c = Configure, m = make, M = make (after miniperl), t = make test-prep

v5.21.8-265-g9efda33  Configuration (common) -Accflags="-fsanitize=address -Werror=declaration-after-statement" -Aldflags="-fsanitize=address" -Dcc=clang
----------- ---------------------------------------------------------
F F         
m F         -Duseithreads
| +--------- -DDEBUGGING
+----------- no debugging


Locally applied patches:
    SMOKE9efda33a86bb90e4838144d230a4fc3ae4d63d7d

Testsuite was run only with 'harness'

Failures: (common-args) -Accflags="-fsanitize=address -Werror=declaration-after-statement" -Aldflags="-fsanitize=address" -Dcc=clang
[default] 
[default] -DDEBUGGING
../t/re/pat.t...............................................FAILED
    Non-zero exit status: 1
    Bad plan.  You planned 765 tests but ran 763.

[default] -DDEBUGGING -Duseithreads
../t/re/pat.t...............................................FAILED
    Non-zero exit status: 1
    Bad plan.  You planned 765 tests but ran 763.
../t/re/pat_thr.t...........................................FAILED
    Non-zero exit status: 1
    Bad plan.  You planned 765 tests but ran 763.

Compiler messages(gcc):
try.c:8030:40: error: __has_include must be used within a preprocessing directive
try.c:8042:45: error: __has_include_next must be used within a preprocessing directive
util.c:183:7: warning: unused label 'out_of_memory' [-Wunused-label]
util.c:300:11: warning: unused label 'out_of_memory' [-Wunused-label]
ListUtil.xs:688:17: warning: unused variable 'a' [-Wunused-variable]
ListUtil.xs:689:17: warning: unused variable 'b' [-Wunused-variable]
ListUtil.xs:730:17: warning: unused variable 'a' [-Wunused-variable]
ListUtil.xs:731:17: warning: unused variable 'b' [-Wunused-variable]
./sdbm.h:54:20: warning: 'extern' variable has an initializer [-Wextern-initializer]
POSIX.o: In function `XS_POSIX_tmpnam':
Piece.xs:688:18: warning: comparison of integers of different signs: 'int' and 'unsigned long' [-Wsign-compare]
Piece.xs:782:18: warning: comparison of integers of different signs: 'int' and 'unsigned long' [-Wsign-compare]
Piece.xs:1059:29: warning: comparison of integers of different signs: 'int' and 'unsigned long' [-Wsign-compare]
Piece.xs:350:13: warning: unused variable 'copyright' [-Wunused-variable]
Piece.xs:352:13: warning: unused variable 'sccsid' [-Wunused-variable]
-- 
Report by Test::Smoke v1.53 build 1374 running on perl 5.20.1
(Reporter v0.050 / Smoker v0.045)




nntp.perl.org: Perl Programming lists via nntp and http.
Comments to Ask Bjørn Hansen at ask@perl.org | Group listing | About