develooper Front page | perl.perl5.porters | Postings from February 2015

Re: Smoke [ebcdic] v5.21.8-419-gaa57d5a FAIL(X) os/390 23.00 (2817/)

From:
Karl Williamson
Date:
February 8, 2015 16:54
Subject:
Re: Smoke [ebcdic] v5.21.8-419-gaa57d5a FAIL(X) os/390 23.00 (2817/)
Message ID:
54D794D9.3020803@khwilliamson.com
On 02/06/2015 06:22 AM, Yaroslav Kuzmin wrote:
>
> Smoke logs available at https://drive.google.com/file/d/0B5PTttxwo7qAMHRXQUZXMTcweWM
>

The run/locale.t failure was fixed in this run, but the test failed 
because it wasn't expecting all the debugging information.  A new branch 
has been pushed for you to smoke, with that stripped out, so the test 
should now pass.  The op/bop.t test also should now pass. 
dist/Data-Dumper/t/dumper.t might now pass, but probably still needs 
some tweaking.

I've got what I need to look at Encode for now, so the new branch 
doesn't test it nor podlators.

Now I'm delving into the stat failure.  Craig Berry made the following 
suggestion to get started on that.  Please run

  ./perl -Ilib Porting/expand-macro.pl 
'PerlLIO_fstat(my_dirfd(IoDIRP(io)), &PL_statcache)'

and post the one line output.
>
> Automated smoke report for branch ebcdic 5.21.9 patch aa57d5a7a89d393f22dd0b5f83b5190feb2b731a v5.21.8-419-gaa57d5a
> RS12: 2817 (2817/)
>      on        os/390 - 23.00
>      using     c99 version
>      smoketime 4 hours 58 minutes (average 2 hours 29 minutes)
>
> Summary: FAIL(X)
>
> O = OK  F = Failure(s), extended report at the bottom
> X = Failure(s) under TEST but not under harness
> ? = still running or test results not (yet) available
> Build failures during:       - = unknown or N/A
> c = Configure, m = make, M = make (after miniperl), t = make test-prep
>
> v5.21.8-419-gaa57d5a  Configuration (common) none
> ----------- ---------------------------------------------------------
> X X X X
> | | | +----- PERLIO = perlio -DDEBUGGING
> | | +------- PERLIO = stdio  -DDEBUGGING
> | +--------- PERLIO = perlio
> +----------- PERLIO = stdio
>
>
> Locally applied patches:
>      SMOKEaa57d5a7a89d393f22dd0b5f83b5190feb2b731a
>
> Tests skipped on user request:
>      # One test name on a line
> Failures: (common-args) none
> [stdio]
> Inconsistent test results (between TEST and harness):
>      ../t/cpan/podlators/t/man.t............. .......................................... FAILED at test 3
>      ../t/cpan/Encode/t/gsm0338.t............ ......................................... FAILED at test 11
>      ../t/porting/readme.t................... .............................................. FAILED at test 70
>      ../t/op/bop.t........................... ...................................................... FAILED at test 182
>      ../t/op/stat.t.......................... ..................................................... FAILED at test 2
>      ../ext/POSIX/t/sigaction.t.............. ......................................... FAILED--expected 33 tests, saw 30
>      ../t/cpan/podlators/t/termcap.t......... ...................................... FAILED at test 3
>      ../t/cpan/Encode/t/grow.t............... ............................................ FAILED at test 2
>      ../lib/open.t........................... ...................................................... FAILED at test 24
>      ../lib/DBM_Filter/t/encode.t............ ....................................... FAILED at test 25
>      ../t/cpan/podlators/t/text.t............ ......................................... FAILED at test 5
>      ../t/cpan/Encode/t/decode.t............. .......................................... FAILED at test 1
>      ../t/cpan/Encode/t/jis7-fallback.t...... ................................... FAILED--no leader found
>      ../t/dist/Data-Dumper/t/dumper.t........ ..................................... FAILED at test 1
>      ../t/cpan/podlators/t/text-encoding.t... ................................ FAILED at test 3
>      ../t/cpan/podlators/t/color.t........... ........................................ FAILED at test 3
>      ../t/cpan/podlators/t/basic.t........... ........................................ FAILED at test 6
>      ../t/cpan/Encode/t/cow.t................ ............................................. FAILED at test 1
>      ../t/run/locale.t....................... .................................................. FAILED at test 30
>      ../t/op/pack.t.......................... ..................................................... FAILED at test 4174
>
> [perlio]
> Inconsistent test results (between TEST and harness):
>      ../t/op/bop.t........................... ...................................................... FAILED at test 182
>      ../t/cpan/podlators/t/man.t............. .......................................... FAILED at test 3
>      ../t/cpan/Encode/t/gsm0338.t............ ......................................... FAILED at test 11
>      ../t/porting/readme.t................... .............................................. FAILED at test 70
>      ../t/op/stat.t.......................... ..................................................... FAILED at test 2
>      ../t/cpan/podlators/t/termcap.t......... ...................................... FAILED at test 3
>      ../t/cpan/Encode/t/grow.t............... ............................................ FAILED at test 2
>      ../lib/open.t........................... ...................................................... FAILED at test 24
>      ../ext/POSIX/t/sigaction.t.............. ......................................... FAILED--expected 33 tests, saw 30
>      ../t/cpan/podlators/t/text.t............ ......................................... FAILED at test 5
>      ../lib/DBM_Filter/t/encode.t............ ....................................... FAILED at test 25
>      ../t/cpan/podlators/t/text-encoding.t... ................................ FAILED at test 3
>      ../t/cpan/podlators/t/color.t........... ........................................ FAILED at test 3
>      ../t/dist/Data-Dumper/t/dumper.t........ ..................................... FAILED at test 1
>      ../t/cpan/Encode/t/decode.t............. .......................................... FAILED at test 1
>      ../t/cpan/Encode/t/jis7-fallback.t...... ................................... FAILED--no leader found
>      ../t/cpan/podlators/t/basic.t........... ........................................ FAILED at test 6
>      ../t/cpan/Encode/t/cow.t................ ............................................. FAILED at test 1
>      ../t/op/pack.t.......................... ..................................................... FAILED at test 4174
>      ../t/run/locale.t....................... .................................................. FAILED at test 30
>
> [stdio] -DDEBUGGING
> Inconsistent test results (between TEST and harness):
>      ../t/cpan/podlators/t/basic.t........... ........................................ FAILED at test 6
>      ../t/cpan/Encode/t/cow.t................ ............................................. FAILED at test 1
>      ../t/op/pack.t.......................... ..................................................... FAILED at test 4174
>      ../t/run/locale.t....................... .................................................. FAILED at test 30
>      ../t/cpan/podlators/t/text.t............ ......................................... FAILED at test 5
>      ../lib/DBM_Filter/t/encode.t............ ....................................... FAILED at test 25
>      ../t/cpan/podlators/t/color.t........... ........................................ FAILED at test 3
>      ../t/cpan/podlators/t/text-encoding.t... ................................ FAILED at test 3
>      ../t/dist/Data-Dumper/t/dumper.t........ ..................................... FAILED at test 1
>      ../t/cpan/Encode/t/jis7-fallback.t...... ................................... FAILED--no leader found
>      ../t/cpan/Encode/t/decode.t............. .......................................... FAILED at test 1
>      ../t/op/stat.t.......................... ..................................................... FAILED at test 2
>      ../lib/open.t........................... ...................................................... FAILED at test 24
>      ../t/cpan/Encode/t/grow.t............... ............................................ FAILED at test 2
>      ../t/cpan/podlators/t/termcap.t......... ...................................... FAILED at test 3
>      ../ext/POSIX/t/sigaction.t.............. ......................................... FAILED--expected 33 tests, saw 30
>      ../t/op/bop.t........................... ...................................................... FAILED at test 182
>      ../t/cpan/Encode/t/gsm0338.t............ ......................................... FAILED at test 11
>      ../t/porting/readme.t................... .............................................. FAILED at test 70
>      ../t/cpan/podlators/t/man.t............. .......................................... FAILED at test 3
>
> [perlio] -DDEBUGGING
> Inconsistent test results (between TEST and harness):
>      ../lib/DBM_Filter/t/encode.t............ ....................................... FAILED at test 25
>      ../t/cpan/podlators/t/text.t............ ......................................... FAILED at test 5
>      ../t/cpan/Encode/t/jis7-fallback.t...... ................................... FAILED--no leader found
>      ../t/cpan/Encode/t/decode.t............. .......................................... FAILED at test 1
>      ../t/dist/Data-Dumper/t/dumper.t........ ..................................... FAILED at test 1
>      ../t/cpan/podlators/t/text-encoding.t... ................................ FAILED at test 3
>      ../t/cpan/podlators/t/color.t........... ........................................ FAILED at test 3
>      ../t/cpan/podlators/t/basic.t........... ........................................ FAILED at test 6
>      ../t/cpan/Encode/t/cow.t................ ............................................. FAILED at test 1
>      ../t/run/locale.t....................... .................................................. FAILED at test 30
>      ../t/op/pack.t.......................... ..................................................... FAILED at test 4174
>      ../t/cpan/podlators/t/man.t............. .......................................... FAILED at test 3
>      ../t/cpan/Encode/t/gsm0338.t............ ......................................... FAILED at test 11
>      ../t/porting/readme.t................... .............................................. FAILED at test 70
>      ../t/op/bop.t........................... ...................................................... FAILED at test 182
>      ../t/op/stat.t.......................... ..................................................... FAILED at test 2
>      ../ext/POSIX/t/sigaction.t.............. ......................................... FAILED--expected 33 tests, saw 30
>      ../t/cpan/Encode/t/grow.t............... ............................................ FAILED at test 2
>      ../lib/open.t........................... ...................................................... FAILED at test 24
>      ../t/cpan/podlators/t/termcap.t......... ...................................... FAILED at test 3
>
> Compiler messages(os390):
>
>
>
> --
> Report by Test::Smoke v1.6 running on perl 5.21.7
> (Reporter v0.052 / Smoker v0.045)
>
>
> ------------------------------------------------------------------------
>   Yaroslav Kuzmin
> Developer C/C++ ,z/OS , Linux
> 3 Zhukovskiy Street · Miass, Chelyabinsk region 456318 · Russia
> Tel:  +7.922.2.38.33.38
> Email: YKuzmin@rocketsoftware.com
> Web: www.rocketsoftware.com
> ================================
> Rocket Software, Inc. and subsidiaries ■ 77 Fourth Avenue, Waltham MA 02451 ■ +1 800.966.3270 ■ +1 781.577.4321
> Unsubscribe From Commercial Email – unsubscribe@rocketsoftware.com
> Manage Your Subscription Preferences - http://info.rocketsoftware.com/GlobalSubscriptionManagementEmailFooter_SubscriptionCenter.html
> Privacy Policy - http://www.rocketsoftware.com/company/legal/privacy-policy
> ================================
>
> This communication and any attachments may contain confidential information of Rocket Software, Inc. All unauthorized use, disclosure or distribution is prohibited. If you are not the intended recipient, please notify Rocket Software immediately and destroy all copies of this communication. Thank you.
>




nntp.perl.org: Perl Programming lists via nntp and http.
Comments to Ask Bjørn Hansen at ask@perl.org | Group listing | About