develooper Front page | perl.perl5.porters | Postings from February 2015

Smoke [blead] v5.21.8-205-g3c81f0b FAIL(Fc) linux 3.16.0-30-generic [debian] (x86_64/8 cpu) {blead_clang_quick_sanitize=address}

Thread Next
From:
George Greer
Date:
February 5, 2015 04:47
Subject:
Smoke [blead] v5.21.8-205-g3c81f0b FAIL(Fc) linux 3.16.0-30-generic [debian] (x86_64/8 cpu) {blead_clang_quick_sanitize=address}
Message ID:
201502050447.t154lUDu008364@m-l.org
Smoke logs available at http://m-l.org/~perl/smoke/perl/linux/blead_clang_quick_sanitize=address/log3c81f0b3e2da864d10c7b9a137e68516f2c94ce4.log.gz

Automated smoke report for 5.21.9 patch 3c81f0b3e2da864d10c7b9a137e68516f2c94ce4 v5.21.8-205-g3c81f0b
zwei: Intel(R) Core(TM) i7 CPU 920 @ 2.67GHz (GenuineIntel 2668MHz) (x86_64/8 cpu)
    on        linux - 3.16.0-30-generic [debian]
    using     clang version 4.2.1 Compatible Ubuntu Clang 3.5.0 (tags/RELEASE_350/final)
    smoketime 1 hour 25 minutes (average 21 minutes 26 seconds)

Summary: FAIL(Fc)

O = OK  F = Failure(s), extended report at the bottom
X = Failure(s) under TEST but not under harness
? = still running or test results not (yet) available
Build failures during:       - = unknown or N/A
c = Configure, m = make, M = make (after miniperl), t = make test-prep

v5.21.8-205-g3c81f0b  Configuration (common) -Accflags="-fsanitize=address -Werror=declaration-after-statement" -Aldflags="-fsanitize=address" -Dcc=clang
----------- ---------------------------------------------------------
O F         
c c         -Duseithreads
| +--------- -DDEBUGGING
+----------- no debugging


Locally applied patches:
    SMOKE3c81f0b3e2da864d10c7b9a137e68516f2c94ce4

Testsuite was run only with 'harness'

Failures: (common-args) -Accflags="-fsanitize=address -Werror=declaration-after-statement" -Aldflags="-fsanitize=address" -Dcc=clang
[default] -DDEBUGGING
../dist/ExtUtils-ParseXS/t/001-basic.t......................FAILED
    8
    Non-zero exit status: 2
    Bad plan.  You planned 17 tests but ran 8.
../dist/ExtUtils-CBuilder/t/02-link.t.......................FAILED
    5-8
    Non-zero exit status: 4
../dist/ExtUtils-ParseXS/t/002-more.t.......................FAILED
    7, 9
    Non-zero exit status: 2
    Bad plan.  You planned 29 tests but ran 9.
../dist/ExtUtils-ParseXS/t/003-usage.t......................FAILED
    7, 9, 11, 13, 15, 17-18, 20-22, 24
    Non-zero exit status: 11
../lib/ExtUtils/t/Embed.t...................................FAILED
    1, 10
../cpan/ExtUtils-MakeMaker/t/xs.t...........................FAILED
    5
    Non-zero exit status: 1

Compiler messages(gcc):
try.c:8030:40: error: __has_include must be used within a preprocessing directive
try.c:8042:45: error: __has_include_next must be used within a preprocessing directive
ListUtil.xs:688:17: warning: unused variable 'a' [-Wunused-variable]
ListUtil.xs:689:17: warning: unused variable 'b' [-Wunused-variable]
ListUtil.xs:730:17: warning: unused variable 'a' [-Wunused-variable]
ListUtil.xs:731:17: warning: unused variable 'b' [-Wunused-variable]
POSIX.o: In function `XS_POSIX_tmpnam':
./sdbm.h:54:20: warning: 'extern' variable has an initializer [-Wextern-initializer]
Piece.xs:688:18: warning: comparison of integers of different signs: 'int' and 'unsigned long' [-Wsign-compare]
Piece.xs:782:18: warning: comparison of integers of different signs: 'int' and 'unsigned long' [-Wsign-compare]
Piece.xs:1059:29: warning: comparison of integers of different signs: 'int' and 'unsigned long' [-Wsign-compare]
Piece.xs:350:13: warning: unused variable 'copyright' [-Wunused-variable]
Piece.xs:352:13: warning: unused variable 'sccsid' [-Wunused-variable]
-- 
Report by Test::Smoke v1.53 build 1374 running on perl 5.20.1
(Reporter v0.050 / Smoker v0.045)


Thread Next


nntp.perl.org: Perl Programming lists via nntp and http.
Comments to Ask Bjørn Hansen at ask@perl.org | Group listing | About