develooper Front page | perl.perl5.porters | Postings from February 2015

Smoke [blead] v5.21.8-188-g65e9632 FAIL(M) MSWin32 Win2000 SP4 (x86/1 cpu) {blead}

From:
George Greer
Date:
February 3, 2015 01:14
Subject:
Smoke [blead] v5.21.8-188-g65e9632 FAIL(M) MSWin32 Win2000 SP4 (x86/1 cpu) {blead}
Message ID:
20150203011412.52DCC4E0549@zwei
Smoke logs available at http://m-l.org/~perl/smoke/perl/win32/blead/log65e96328dc059ab074d6218137c73aae8cb058e2.log.gz

Known failures on Win32:

../t/win32/popen.t..........................................FAILED
    Non-zero exit status: 9
    No plan found in TAP output

../cpan/Time-HiRes/t/usleep.t...............................FAILED
    3
    Non-zero exit status: 1

../t/op/threads.t...........................................FAILED
    Non-zero exit status: 9
    Bad plan.  You planned 27 tests but ran 9.

../cpan/IPC-Cmd/t/01_IPC-Cmd.t..............................FAILED
    27-28
    42
    115-116
    Non-zero exit status: 2

Automated smoke report for 5.21.9 patch 65e96328dc059ab074d6218137c73aae8cb058e2 v5.21.8-188-g65e9632
perl-win2k: Intel(R) Core(TM) i7 CPU 920 @ 2.67GHz(~2661 MHz) (x86/1 cpu)
    on        MSWin32 - Win2000 SP4
    using     cl version 14.00.50727.762
    smoketime 28 minutes 57 seconds (average 7 minutes 14 seconds)

Summary: FAIL(M)

O = OK  F = Failure(s), extended report at the bottom
X = Failure(s) under TEST but not under harness
? = still running or test results not (yet) available
Build failures during:       - = unknown or N/A
c = Configure, m = make, M = make (after miniperl), t = make test-prep

v5.21.8-188-g65e9632  Configuration (common) none
----------- ---------------------------------------------------------
M M         
M M         -Duseithreads
| +--------- -DDEBUGGING
+----------- no debugging


Locally applied patches:
    SMOKE65e96328dc059ab074d6218137c73aae8cb058e2

Compiler messages(MSWin32):
..\universal.c(906) : warning C4244: 'initializing' : conversion from 'I32' to 'const U8', possible loss of data
B.xs(831) : error C2121: '#' : invalid character : possibly the result of a macro expansion
B.xs(831) : error C2065: 'ifdef' : undeclared identifier
B.xs(831) : warning C4047: 'function' : 'SV *' differs in levels of indirection from 'int'
B.xs(831) : warning C4024: 'Perl_sv_setsv_flags' : different types for formal and actual parameter 2
B.xs(831) : error C2146: syntax error : missing ')' before identifier 'PERL_OP_PARENT'
B.xs(831) : error C2198: 'Perl_sv_setsv_flags' : too few arguments for call
B.xs(831) : error C2059: syntax error : ')'
B.xs(831) : warning C4024: 'Perl_sv_setsv_flags' : different types for formal and actual parameter 3
-- 
Report by Test::Smoke v1.53 build 1374 running on perl 5.10.0
(Reporter v0.050 / Smoker v0.045)




nntp.perl.org: Perl Programming lists via nntp and http.
Comments to Ask Bjørn Hansen at ask@perl.org | Group listing | About