develooper Front page | perl.perl5.porters | Postings from January 2015

>>: Smoke [ebcdic] v5.21.8-225-g93e5510 FAIL(X) os/390 23.00 (2817/)

Thread Next
From:
Yaroslav Kuzmin
Date:
January 27, 2015 08:58
Subject:
>>: Smoke [ebcdic] v5.21.8-225-g93e5510 FAIL(X) os/390 23.00 (2817/)
Message ID:
24c6aae67c14484fb0629c3167fe91de@wal-s-mbx2.rocketsoftware.com

Smoke logs available at https://drive.google.com/file/d/0B5PTttxwo7qANFBHUkVMTTB3MlE


Automated smoke report for branch ebcdic 5.21.9 patch 93e5510397bc46a24fd2b67e6c5b77c395836f40 v5.21.8-225-g93e5510
RS12: 2817 (2817/)
    on        os/390 - 23.00
    using     c99 version
    smoketime 4 hours 50 minutes (average 2 hours 25 minutes)

Summary: FAIL(X)

O = OK  F = Failure(s), extended report at the bottom
X = Failure(s) under TEST but not under harness
? = still running or test results not (yet) available
Build failures during:       - = unknown or N/A
c = Configure, m = make, M = make (after miniperl), t = make test-prep

v5.21.8-225-g93e5510  Configuration (common) none
----------- ---------------------------------------------------------
X X X X
| | | +----- PERLIO = perlio -DDEBUGGING
| | +------- PERLIO = stdio  -DDEBUGGING
| +--------- PERLIO = perlio
+----------- PERLIO = stdio


Locally applied patches:
    SMOKE93e5510397bc46a24fd2b67e6c5b77c395836f40

Tests skipped on user request:
    # One test name on a line
Failures: (common-args) none
[stdio]
Inconsistent test results (between TEST and harness):
    ../lib/DBM_Filter/t/encode.t............ ....................................... FAILED at test 25
    ../t/op/pack.t.......................... ..................................................... FAILED at test 4174
    ../t/re/pat_advanced.t.................. ............................................. FAILED at test 776
    ../t/run/locale.t....................... .................................................. FAILED at test 30
    ../t/cpan/Pod-Simple/t/fcodes_s.t....... .................................... FAILED at test 40
    ../lib/open.t........................... ...................................................... FAILED at test 24
    ../t/op/stat.t.......................... ..................................................... FAILED at test 2
    ../t/dist/ExtUtils-CBuilder/t/04-base.t. .............................. FAILED at test 44
    ../t/cpan/Pod-Simple/t/search20.t....... .................................... FAILED--expected 11 tests, saw 2
    ../t/cpan/Pod-Simple/t/search12.t....... .................................... FAILED--expected 11 tests, saw 2
    ../t/cpan/Pod-Simple/t/search10.t....... .................................... FAILED--expected 11 tests, saw 2
    ../t/cpan/Pod-Simple/t/search28.t....... .................................... FAILED--expected 4 tests, saw 2
    ../t/cpan/Pod-Simple/t/search26.t....... .................................... FAILED--expected 5 tests, saw 2
    ../t/cpan/Pod-Simple/t/search22.t....... .................................... FAILED--expected 13 tests, saw 2
    ../t/dist/Data-Dumper/t/dumper.t........ ..................................... FAILED at test 1
    ../t/porting/readme.t................... .............................................. FAILED at test 70
    ../ext/POSIX/t/sigaction.t.............. ......................................... FAILED--expected 33 tests, saw 30
    ../t/cpan/Pod-Simple/t/encod04.t........ ..................................... FAILED at test 2

[perlio]
Inconsistent test results (between TEST and harness):
    ../t/cpan/Pod-Simple/t/search10.t....... .................................... FAILED--expected 11 tests, saw 2
    ../t/cpan/Pod-Simple/t/search12.t....... .................................... FAILED--expected 11 tests, saw 2
    ../t/cpan/Pod-Simple/t/search20.t....... .................................... FAILED--expected 11 tests, saw 2
    ../t/cpan/Pod-Simple/t/encod04.t........ ..................................... FAILED at test 2
    ../ext/POSIX/t/sigaction.t.............. ......................................... FAILED--expected 33 tests, saw 30
    ../t/porting/readme.t................... .............................................. FAILED at test 70
    ../t/cpan/Pod-Simple/t/search26.t....... .................................... FAILED--expected 5 tests, saw 2
    ../t/cpan/Pod-Simple/t/search22.t....... .................................... FAILED--expected 13 tests, saw 2
    ../t/dist/Data-Dumper/t/dumper.t........ ..................................... FAILED at test 1
    ../t/cpan/Pod-Simple/t/search28.t....... .................................... FAILED--expected 4 tests, saw 2
    ../t/run/locale.t....................... .................................................. FAILED at test 30
    ../t/re/pat_advanced.t.................. ............................................. FAILED at test 776
    ../lib/DBM_Filter/t/encode.t............ ....................................... FAILED at test 25
    ../t/op/pack.t.......................... ..................................................... FAILED at test 4174
    ../t/dist/ExtUtils-CBuilder/t/04-base.t. .............................. FAILED at test 44
    ../lib/open.t........................... ...................................................... FAILED at test 24
    ../t/op/stat.t.......................... ..................................................... FAILED at test 2
    ../t/cpan/Pod-Simple/t/fcodes_s.t....... .................................... FAILED at test 40

[stdio] -DDEBUGGING
Inconsistent test results (between TEST and harness):
    ../t/cpan/Pod-Simple/t/encod04.t........ ..................................... FAILED at test 2
    ../ext/POSIX/t/sigaction.t.............. ......................................... FAILED--expected 33 tests, saw 30
    ../t/dist/Data-Dumper/t/dumper.t........ ..................................... FAILED at test 1
    ../t/cpan/Pod-Simple/t/search22.t....... .................................... FAILED--expected 13 tests, saw 2
    ../t/cpan/Pod-Simple/t/search26.t....... .................................... FAILED--expected 5 tests, saw 2
    ../t/cpan/Pod-Simple/t/search28.t....... .................................... FAILED--expected 4 tests, saw 2
    ../t/porting/readme.t................... .............................................. FAILED at test 70
    ../t/cpan/Pod-Simple/t/search10.t....... .................................... FAILED--expected 11 tests, saw 2
    ../t/cpan/Pod-Simple/t/search12.t....... .................................... FAILED--expected 11 tests, saw 2
    ../t/cpan/Pod-Simple/t/search20.t....... .................................... FAILED--expected 11 tests, saw 2
    ../t/op/stat.t.......................... ..................................................... FAILED at test 2
    ../lib/open.t........................... ...................................................... FAILED at test 24
    ../t/dist/ExtUtils-CBuilder/t/04-base.t. .............................. FAILED at test 44
    ../t/cpan/Pod-Simple/t/fcodes_s.t....... .................................... FAILED at test 40
    ../t/re/pat_advanced.t.................. ............................................. FAILED at test 776
    ../t/op/pack.t.......................... ..................................................... FAILED at test 4174
    ../lib/DBM_Filter/t/encode.t............ ....................................... FAILED at test 25
    ../t/run/locale.t....................... .................................................. FAILED at test 30

[perlio] -DDEBUGGING
Inconsistent test results (between TEST and harness):
    ../t/dist/ExtUtils-CBuilder/t/04-base.t. .............................. FAILED at test 44
    ../t/op/stat.t.......................... ..................................................... FAILED at test 2
    ../lib/open.t........................... ...................................................... FAILED at test 24
    ../t/cpan/Pod-Simple/t/fcodes_s.t....... .................................... FAILED at test 40
    ../t/run/locale.t....................... .................................................. FAILED at test 30
    ../t/op/pack.t.......................... ..................................................... FAILED at test 4174
    ../lib/DBM_Filter/t/encode.t............ ....................................... FAILED at test 25
    ../t/re/pat_advanced.t.................. ............................................. FAILED at test 776
    ../ext/POSIX/t/sigaction.t.............. ......................................... FAILED--expected 33 tests, saw 30
    ../t/cpan/Pod-Simple/t/encod04.t........ ..................................... FAILED at test 2
    ../t/porting/readme.t................... .............................................. FAILED at test 70
    ../t/cpan/Pod-Simple/t/search28.t....... .................................... FAILED--expected 4 tests, saw 2
    ../t/cpan/Pod-Simple/t/search22.t....... .................................... FAILED--expected 13 tests, saw 2
    ../t/dist/Data-Dumper/t/dumper.t........ ..................................... FAILED at test 1
    ../t/cpan/Pod-Simple/t/search26.t....... .................................... FAILED--expected 5 tests, saw 2
    ../t/cpan/Pod-Simple/t/search10.t....... .................................... FAILED--expected 11 tests, saw 2
    ../t/cpan/Pod-Simple/t/search20.t....... .................................... FAILED--expected 11 tests, saw 2
    ../t/cpan/Pod-Simple/t/search12.t....... .................................... FAILED--expected 11 tests, saw 2

Compiler messages(os390):



--
Report by Test::Smoke v1.6 running on perl 5.21.7
(Reporter v0.052 / Smoker v0.045)


------------------------------------------------------------------------
 Yaroslav Kuzmin
Developer C/C++ ,z/OS , Linux
3 Zhukovskiy Street · Miass, Chelyabinsk region 456318 · Russia
Tel:  +7.922.2.38.33.38
Email: YKuzmin@rocketsoftware.com
Web: www.rocketsoftware.com
================================
Rocket Software, Inc. and subsidiaries ■ 77 Fourth Avenue, Waltham MA 02451 ■ +1 800.966.3270 ■ +1 781.577.4321
Unsubscribe From Commercial Email – unsubscribe@rocketsoftware.com
Manage Your Subscription Preferences - http://info.rocketsoftware.com/GlobalSubscriptionManagementEmailFooter_SubscriptionCenter.html
Privacy Policy - http://www.rocketsoftware.com/company/legal/privacy-policy
================================

This communication and any attachments may contain confidential information of Rocket Software, Inc. All unauthorized use, disclosure or distribution is prohibited. If you are not the intended recipient, please notify Rocket Software immediately and destroy all copies of this communication. Thank you.

Thread Next


nntp.perl.org: Perl Programming lists via nntp and http.
Comments to Ask Bjørn Hansen at ask@perl.org | Group listing | About