develooper Front page | perl.perl5.porters | Postings from January 2015

Smoke [ebcdic] v5.21.7-523-gd0c3d42 FAIL(X) os/390 23.00 (2817/)

From:
Yaroslav Kuzmin
Date:
January 16, 2015 07:46
Subject:
Smoke [ebcdic] v5.21.7-523-gd0c3d42 FAIL(X) os/390 23.00 (2817/)
Message ID:
924f47e23f514460a33926a703596770@wal-s-mbx2.rocketsoftware.com
Smoke logs available at https://drive.google.com/file/d/0B5PTttxwo7qAZk5faE1ic0w3OWs
(set verbose mode -v 2  Test::smoke, but file *.log *.out *.rpt not copy in dir smoke/logs )


Automated smoke report for branch ebcdic 5.21.8 patch d0c3d4234a0e8606e19dca3d570c56eae7f0e5aa v5.21.7-523-gd0c3d42
RS12: 2817 (2817/)
    on        os/390 - 23.00
    using     c99 version
    smoketime 5 hours 35 minutes (average 2 hours 47 minutes)

Summary: FAIL(X)

O = OK  F = Failure(s), extended report at the bottom
X = Failure(s) under TEST but not under harness
? = still running or test results not (yet) available
Build failures during:       - = unknown or N/A
c = Configure, m = make, M = make (after miniperl), t = make test-prep

v5.21.7-523-gd0c3d42  Configuration (common) none
----------- ---------------------------------------------------------
X X X X
| | | +----- PERLIO = perlio -DDEBUGGING
| | +------- PERLIO = stdio  -DDEBUGGING
| +--------- PERLIO = perlio
+----------- PERLIO = stdio


Locally applied patches:
    SMOKEd0c3d4234a0e8606e19dca3d570c56eae7f0e5aa

Tests skipped on user request:
    # One test name on a line
Failures: (common-args) none
[stdio]
Inconsistent test results (between TEST and harness):
    ../t/cpan/Pod-Simple/t/search12.t....... .................................... FAILED at test 3
    ../t/cpan/Pod-Simple/t/search20.t....... .................................... FAILED at test 3
    ../t/cpan/Pod-Simple/t/fcodes_s.t....... .................................... FAILED at test 36
    ../t/cpan/Pod-Simple/t/search28.t....... .................................... FAILED at test 3
    ../t/run/locale.t....................... .................................................. FAILED at test 30
    ../t/cpan/Pod-Simple/t/search26.t....... .................................... FAILED at test 3
    ../t/re/pat_advanced.t.................. ............................................. FAILED at test 776
    ../t/op/stat.t.......................... ..................................................... FAILED at test 2
    ../t/cpan/Pod-Simple/t/output.t......... ...................................... FAILED at test 32
    ../t/dist/Net-Ping/t/450_service.t...... ................................... FAILED at test 9
    ../t/porting/readme.t................... .............................................. FAILED at test 70
    ../t/cpan/Pod-Simple/t/search22.t....... .................................... FAILED at test 3
    ../t/dist/Data-Dumper/t/dumper.t........ ..................................... FAILED at test 2
    ../lib/open.t........................... ...................................................... FAILED at test 24
    ../t/cpan/Pod-Simple/t/xhtml01.t........ ..................................... FAILED at test 39
    ../t/cpan/Pod-Simple/t/encod04.t........ ..................................... FAILED at test 2
    ../t/dist/ExtUtils-CBuilder/t/04-base.t. .............................. FAILED at test 44
    ../t/cpan/Pod-Simple/t/search10.t....... .................................... FAILED at test 3
    ../t/cpan/Pod-Simple/t/corpus.t......... ...................................... FAILED at test 2
    ../t/op/pack.t.......................... ..................................................... FAILED at test 4174
    ../ext/POSIX/t/sigaction.t.............. ......................................... FAILED--expected 33 tests, saw 30

[perlio]
Inconsistent test results (between TEST and harness):
    ../t/dist/ExtUtils-CBuilder/t/04-base.t. .............................. FAILED at test 44
    ../t/cpan/Pod-Simple/t/search10.t....... .................................... FAILED at test 3
    ../t/cpan/Pod-Simple/t/corpus.t......... ...................................... FAILED at test 2
    ../t/op/pack.t.......................... ..................................................... FAILED at test 4174
    ../ext/POSIX/t/sigaction.t.............. ......................................... FAILED--expected 33 tests, saw 30
    ../lib/open.t........................... ...................................................... FAILED at test 24
    ../t/cpan/Pod-Simple/t/xhtml01.t........ ..................................... FAILED at test 39
    ../t/cpan/Pod-Simple/t/encod04.t........ ..................................... FAILED at test 2
    ../t/dist/Net-Ping/t/450_service.t...... ................................... FAILED at test 9
    ../t/cpan/Pod-Simple/t/output.t......... ...................................... FAILED at test 32
    ../t/porting/readme.t................... .............................................. FAILED at test 70
    ../t/cpan/Pod-Simple/t/search22.t....... .................................... FAILED at test 3
    ../t/dist/Data-Dumper/t/dumper.t........ ..................................... FAILED at test 2
    ../t/cpan/Pod-Simple/t/search12.t....... .................................... FAILED at test 3
    ../t/cpan/Pod-Simple/t/search20.t....... .................................... FAILED at test 3
    ../t/cpan/Pod-Simple/t/search28.t....... .................................... FAILED at test 3
    ../t/cpan/Pod-Simple/t/fcodes_s.t....... .................................... FAILED at test 36
    ../t/run/locale.t....................... .................................................. FAILED at test 30
    ../t/cpan/Pod-Simple/t/search26.t....... .................................... FAILED at test 3
    ../t/re/pat_advanced.t.................. ............................................. FAILED at test 776
    ../t/op/stat.t.......................... ..................................................... FAILED at test 2

[stdio] -DDEBUGGING
Inconsistent test results (between TEST and harness):
    ../t/cpan/Pod-Simple/t/xhtml01.t........ ..................................... FAILED at test 39
    ../t/cpan/Pod-Simple/t/encod04.t........ ..................................... FAILED at test 2
    ../lib/open.t........................... ...................................................... FAILED at test 24
    ../ext/POSIX/t/sigaction.t.............. ......................................... FAILED--expected 33 tests, saw 30
    ../t/op/pack.t.......................... ..................................................... FAILED at test 4174
    ../t/dist/ExtUtils-CBuilder/t/04-base.t. .............................. FAILED at test 44
    ../t/cpan/Pod-Simple/t/search10.t....... .................................... FAILED at test 3
    ../t/cpan/Pod-Simple/t/corpus.t......... ...................................... FAILED at test 2
    ../t/re/pat_advanced.t.................. ............................................. FAILED at test 776
    ../t/op/stat.t.......................... ..................................................... FAILED at test 2
    ../t/cpan/Pod-Simple/t/search12.t....... .................................... FAILED at test 3
    ../t/cpan/Pod-Simple/t/search20.t....... .................................... FAILED at test 3
    ../t/cpan/Pod-Simple/t/fcodes_s.t....... .................................... FAILED at test 36
    ../t/cpan/Pod-Simple/t/search28.t....... .................................... FAILED at test 3
    ../t/run/locale.t....................... .................................................. FAILED at test 30
    ../t/cpan/Pod-Simple/t/search26.t....... .................................... FAILED at test 3
    ../t/dist/Data-Dumper/t/dumper.t........ ..................................... FAILED at test 2
    ../t/cpan/Pod-Simple/t/output.t......... ...................................... FAILED at test 32
    ../t/dist/Net-Ping/t/450_service.t...... ................................... FAILED at test 9
    ../t/cpan/Pod-Simple/t/search22.t....... .................................... FAILED at test 3
    ../t/porting/readme.t................... .............................................. FAILED at test 70

[perlio] -DDEBUGGING
Inconsistent test results (between TEST and harness):
    ../t/cpan/Pod-Simple/t/encod04.t........ ..................................... FAILED at test 2
    ../t/cpan/Pod-Simple/t/xhtml01.t........ ..................................... FAILED at test 39
    ../lib/open.t........................... ...................................................... FAILED at test 24
    ../t/op/pack.t.......................... ..................................................... FAILED at test 4174
    ../ext/POSIX/t/sigaction.t.............. ......................................... FAILED--expected 33 tests, saw 30
    ../t/cpan/Pod-Simple/t/corpus.t......... ...................................... FAILED at test 2
    ../t/cpan/Pod-Simple/t/search10.t....... .................................... FAILED at test 3
    ../t/dist/ExtUtils-CBuilder/t/04-base.t. .............................. FAILED at test 44
    ../t/op/stat.t.......................... ..................................................... FAILED at test 2
    ../t/re/pat_advanced.t.................. ............................................. FAILED at test 776
    ../t/cpan/Pod-Simple/t/search26.t....... .................................... FAILED at test 3
    ../t/run/locale.t....................... .................................................. FAILED at test 30
    ../t/cpan/Pod-Simple/t/search28.t....... .................................... FAILED at test 3
    ../t/cpan/Pod-Simple/t/fcodes_s.t....... .................................... FAILED at test 36
    ../t/cpan/Pod-Simple/t/search20.t....... .................................... FAILED at test 3
    ../t/cpan/Pod-Simple/t/search12.t....... .................................... FAILED at test 3
    ../t/dist/Data-Dumper/t/dumper.t........ ..................................... FAILED at test 2
    ../t/porting/readme.t................... .............................................. FAILED at test 70
    ../t/cpan/Pod-Simple/t/search22.t....... .................................... FAILED at test 3
    ../t/cpan/Pod-Simple/t/output.t......... ...................................... FAILED at test 32
    ../t/dist/Net-Ping/t/450_service.t...... ................................... FAILED at test 9

Compiler messages(os390):



--
Report by Test::Smoke v1.6 running on perl 5.21.7
(Reporter v0.052 / Smoker v0.045)


------------------------------------------------------------------------
 Yaroslav Kuzmin
Developer C/C++ ,z/OS , Linux
3 Zhukovskiy Street · Miass, Chelyabinsk region 456318 · Russia
Tel:  +7.922.2.38.33.38
Email: YKuzmin@rocketsoftware.com
Web: www.rocketsoftware.com
================================
Rocket Software, Inc. and subsidiaries ■ 77 Fourth Avenue, Waltham MA 02451 ■ +1 800.966.3270 ■ +1 781.577.4321
Unsubscribe From Commercial Email – unsubscribe@rocketsoftware.com
Manage Your Subscription Preferences - http://info.rocketsoftware.com/GlobalSubscriptionManagementEmailFooter_SubscriptionCenter.html
Privacy Policy - http://www.rocketsoftware.com/company/legal/privacy-policy
================================

This communication and any attachments may contain confidential information of Rocket Software, Inc. All unauthorized use, disclosure or distribution is prohibited. If you are not the intended recipient, please notify Rocket Software immediately and destroy all copies of this communication. Thank you.



nntp.perl.org: Perl Programming lists via nntp and http.
Comments to Ask Bjørn Hansen at ask@perl.org | Group listing | About