develooper Front page | perl.perl5.porters | Postings from December 2014

Re: Smoke [ebcdic] v5.21.7-261-gdd02b68 FAIL(X) os/390 23.00 (2817/)

Thread Previous
From:
Karl Williamson
Date:
December 29, 2014 05:22
Subject:
Re: Smoke [ebcdic] v5.21.7-261-gdd02b68 FAIL(X) os/390 23.00 (2817/)
Message ID:
54A0E502.9060309@khwilliamson.com
On 12/26/2014 05:21 AM, Yaroslav Kuzmin wrote:
>   Smoke logs available at - https://drive.google.com/file/d/0B5PTttxwo7qAX1dBWUY4UFh5ODA
>
> Automated smoke report for branch ebcdic 5.21.8 patch dd02b68f291c88d46905ddcbe872826d841b3878 v5.21.7-261-gdd02b68
> RS12: 2817 (2817/)
>      on        os/390 - 23.00
>      using     c99 version
>      smoketime 4 hours 32 minutes (average 2 hours 16 minutes)
>
> Summary: FAIL(X)
>

Thanks.  The one test did get fixed, but an unrelated change I made 
broke several other tests.  Those hopefully are fixed in the new version 
I just pushed, which also has some tweaks in debugging for some of the 
other tests.

Some of the existing debugging points to a weirdness in lstat.  The 
errno is coming back like this:

../lib/File/Temp.pm: 834: Cwd::abs_path("/tmp/od52LK53Ai") returned 
nothing, errno=EDC5146I Too many levels of symbolic links.

This can happen when trying to follow links results in a loop.  I'm not 
sure the od52LK53Ai has been actually created yet.  Maybe this is an ibm 
gotcha.



> O = OK  F = Failure(s), extended report at the bottom
> X = Failure(s) under TEST but not under harness
> ? = still running or test results not (yet) available
> Build failures during:       - = unknown or N/A
> c = Configure, m = make, M = make (after miniperl), t = make test-prep
>
> v5.21.7-261-gdd02b68  Configuration (common) none
> ----------- ---------------------------------------------------------
> X X X X
> | | | +----- PERLIO = perlio -DDEBUGGING
> | | +------- PERLIO = stdio  -DDEBUGGING
> | +--------- PERLIO = perlio
> +----------- PERLIO = stdio
>
>
> Locally applied patches:
>      SMOKEdd02b68f291c88d46905ddcbe872826d841b3878
>
> Tests skipped on user request:
>      # One test name on a line
> Failures: (common-args) none
> [stdio]
> Inconsistent test results (between TEST and harness):
>      ../t/re/pat_advanced.t.................. ............................................. FAILED at test 223
>      ../t/run/locale.t....................... .................................................. FAILED at test 30
>      ../t/op/pack.t.......................... ..................................................... FAILED at test 4174
>      ../t/dist/ExtUtils-CBuilder/t/04-base.t. .............................. FAILED at test 44
>      ../t/dist/Data-Dumper/t/dumper.t........ ..................................... FAILED at test 2
>      ../t/porting/readme.t................... .............................................. FAILED at test 70
>      ../t/dist/Net-Ping/t/450_service.t...... ................................... FAILED at test 9
>      ../lib/h2ph.t........................... ...................................................... FAILED at test 1
>      ../t/op/stat.t.......................... ..................................................... FAILED at test 2
>      ../lib/charnames.t...................... ................................................. FAILED at test 508
>      ../t/re/pat_rt_report.t................. ............................................ FAILED at test 2518
>      ../lib/open.t........................... ...................................................... FAILED at test 24
>      ../ext/POSIX/t/sigaction.t.............. ......................................... FAILED--expected 33 tests, saw 30
>
> [perlio]
> Inconsistent test results (between TEST and harness):
>      ../t/re/pat_rt_report.t................. ............................................ FAILED at test 2518
>      ../lib/charnames.t...................... ................................................. FAILED at test 508
>      ../t/op/stat.t.......................... ..................................................... FAILED at test 2
>      ../lib/h2ph.t........................... ...................................................... FAILED at test 1
>      ../t/dist/Net-Ping/t/450_service.t...... ................................... FAILED at test 9
>      ../t/porting/readme.t................... .............................................. FAILED at test 70
>      ../t/dist/Data-Dumper/t/dumper.t........ ..................................... FAILED at test 2
>      ../t/dist/ExtUtils-CBuilder/t/04-base.t. .............................. FAILED at test 44
>      ../t/op/pack.t.......................... ..................................................... FAILED at test 4174
>      ../t/run/locale.t....................... .................................................. FAILED at test 30
>      ../t/re/pat_advanced.t.................. ............................................. FAILED at test 223
>      ../ext/POSIX/t/sigaction.t.............. ......................................... FAILED--expected 33 tests, saw 30
>      ../lib/open.t........................... ...................................................... FAILED at test 24
>
> [stdio] -DDEBUGGING
> Inconsistent test results (between TEST and harness):
>      ../t/run/locale.t....................... .................................................. FAILED at test 30
>      ../t/re/pat_advanced.t.................. ............................................. FAILED at test 223
>      ../t/op/pack.t.......................... ..................................................... FAILED at test 4174
>      ../t/dist/ExtUtils-CBuilder/t/04-base.t. .............................. FAILED at test 44
>      ../t/dist/Data-Dumper/t/dumper.t........ ..................................... FAILED at test 2
>      ../t/dist/Net-Ping/t/450_service.t...... ................................... FAILED at test 9
>      ../t/porting/readme.t................... .............................................. FAILED at test 70
>      ../lib/h2ph.t........................... ...................................................... FAILED at test 1
>      ../t/op/stat.t.......................... ..................................................... FAILED at test 2
>      ../t/re/pat_rt_report.t................. ............................................ FAILED at test 2518
>      ../lib/charnames.t...................... ................................................. FAILED at test 508
>      ../lib/open.t........................... ...................................................... FAILED at test 24
>      ../ext/POSIX/t/sigaction.t.............. ......................................... FAILED--expected 33 tests, saw 30
>
> [perlio] -DDEBUGGING
> Inconsistent test results (between TEST and harness):
>      ../ext/POSIX/t/sigaction.t.............. ......................................... FAILED--expected 33 tests, saw 30
>      ../lib/open.t........................... ...................................................... FAILED at test 24
>      ../t/dist/ExtUtils-CBuilder/t/04-base.t. .............................. FAILED at test 44
>      ../t/dist/Data-Dumper/t/dumper.t........ ..................................... FAILED at test 2
>      ../t/op/pack.t.......................... ..................................................... FAILED at test 4174
>      ../t/run/locale.t....................... .................................................. FAILED at test 30
>      ../t/re/pat_advanced.t.................. ............................................. FAILED at test 223
>      ../t/re/pat_rt_report.t................. ............................................ FAILED at test 2518
>      ../lib/charnames.t...................... ................................................. FAILED at test 508
>      ../lib/h2ph.t........................... ...................................................... FAILED at test 1
>      ../t/op/stat.t.......................... ..................................................... FAILED at test 2
>      ../t/dist/Net-Ping/t/450_service.t...... ................................... FAILED at test 9
>      ../t/porting/readme.t................... .............................................. FAILED at test 70
>
> Compiler messages(os390):
>
> --
> Report by Test::Smoke v1.6 running on perl 5.21.7
> (Reporter v0.052 / Smoker v0.045)
>
>
> P.S. Next week will hold individual tests and the compilation of other parameters.
>
>
> ------------------------------------------------------------------------
>   Yaroslav Kuzmin
> Developer C/C++ ,z/OS , Linux
> 3 Zhukovskiy Street · Miass, Chelyabinsk region 456318 · Russia
> Tel:  +7.922.2.38.33.38
> Email: YKuzmin@rocketsoftware.com
> Web: www.rocketsoftware.com
>
> ================================
> Rocket Software, Inc. and subsidiaries ■ 77 Fourth Avenue, Waltham MA 02451 ■ +1 800.966.3270 ■ +1 781.577.4321
> Unsubscribe From Commercial Email – unsubscribe@rocketsoftware.com
> Manage Your Subscription Preferences - http://info.rocketsoftware.com/GlobalSubscriptionManagementEmailFooter_SubscriptionCenter.html
> Privacy Policy - http://www.rocketsoftware.com/company/legal/privacy-policy
> ================================
>
> This communication and any attachments may contain confidential information of Rocket Software, Inc. All unauthorized use, disclosure or distribution is prohibited. If you are not the intended recipient, please notify Rocket Software immediately and destroy all copies of this communication. Thank you.
>


Thread Previous


nntp.perl.org: Perl Programming lists via nntp and http.
Comments to Ask Bjørn Hansen at ask@perl.org | Group listing | About