develooper Front page | perl.perl5.porters | Postings from December 2014

Re: Smoke [ebcdic] v5.21.6-755-g8f7949d FAIL(X) os/390 23.00 (2817/)

Thread Previous
From:
Karl Williamson
Date:
December 26, 2014 04:40
Subject:
Re: Smoke [ebcdic] v5.21.6-755-g8f7949d FAIL(X) os/390 23.00 (2817/)
Message ID:
549CE6BD.70709@khwilliamson.com
On 12/25/2014 01:10 AM, Yaroslav Kuzmin wrote:
> Smoke logs available at - https://drive.google.com/file/d/0B5PTttxwo7qAakdfbkRDRklfWDA
>
> Automated smoke report for branch ebcdic 5.21.7 patch 8f7949da3760661252f10651cd69851f92dc739f v5.21.6-755-g8f7949d
> RS12: 2817 (2817/)
>      on        os/390 - 23.00
>      using     c99 version
>      smoketime 2 days 17 hours 48 minutes (average 1 day 8 hours 54 minutes)
>
> Summary: FAIL(X)

Thanks for this.  The extra debugging enabled me to find and fix a bug 
which is responsible for one of the failing tests.  Just to be sure, I 
left in the debugging for the newly pushed branch, so it will still fail 
the next run.

For those who don't want to look at the log in detail, you can see from 
below that there are a lot of cpan failures.  (This is the first time 
all of our delivered cpan modules have been tested on this release.) 
Still the pass rate was a respectable 91% (I had guessed it would be 
90.)  Figuring out what to do about these will take some time.

And you can see from above that the smoke time was almost 40% of a week. 
  Previously, it was around 5 hours.  I don't know if it's because the 
The cpan tests are extraordinarily slow, or it's because the machine was 
being shared with other tasks.  In either event, I've turned off cpan 
tests again for now, and will turn on just individual ones as necessary.

So a new branch to try has been pushed; it has been rebased to blead, 
and can't be merged.  It fixes the one test, and hones in a little more 
on some others.

One thing that is very puzzling is that none of the debug output is 
being printed for t/run/locale.t.  Perhaps you could run that test 
manually on a DEBUGGING build to see if it helps
>
> O = OK  F = Failure(s), extended report at the bottom
> X = Failure(s) under TEST but not under harness
> ? = still running or test results not (yet) available
> Build failures during:       - = unknown or N/A
> c = Configure, m = make, M = make (after miniperl), t = make test-prep
>
> v5.21.6-755-g8f7949d  Configuration (common) none
> ----------- ---------------------------------------------------------
> X X X X
> | | | +----- PERLIO = perlio -DDEBUGGING
> | | +------- PERLIO = stdio  -DDEBUGGING
> | +--------- PERLIO = perlio
> +----------- PERLIO = stdio
>
>
> Locally applied patches:
>      SMOKE8f7949da3760661252f10651cd69851f92dc739f
>
> Tests skipped on user request:
>      # One test name on a line
> Failures: (common-args) none
> [stdio]
> Inconsistent test results (between TEST and harness):
>      ../t/cpan/Pod-Simple/t/search10.t....... ..................................... FAILED at test 3
>      ../t/cpan/CPAN-Meta/t/converter-bad.t... ................................. FAILED--no leader found
>      ../t/cpan/JSON-PP/t/107_allow_singlequote.t ........................... FAILED--expected 4 tests, saw 1
>      ../t/cpan/IPC-Cmd/t/01_IPC-Cmd.t........ ...................................... FAILED at test 460
>      ../t/cpan/ExtUtils-MakeMaker/t/miniperl.t ............................. FAILED at test 3
>      ../t/cpan/Encode/t/jis7-fallback.t...... .................................... FAILED--no leader found
>      ../t/cpan/IO-Compress/t/108anyunc-bzip2.t ............................. FAILED at test 5
>      ../t/cpan/Digest-SHA/t/hmacsha.t........ ...................................... FAILED at test 1
>      ../t/cpan/Devel-PPPort/t/pv_tools.t..... ................................... FAILED at test 7
>      ../t/cpan/ExtUtils-MakeMaker/t/INSTALL_BASE.t ......................... FAILED at test 3
>      ../t/cpan/Test-Harness/t/yamlish-output.t ............................. FAILED at test 3
>      ../t/cpan/IO-Compress/t/110encode-bzip2.t ............................. FAILED at test 2
>      ../t/cpan/Digest-SHA/t/woodbury.t....... ..................................... FAILED at test 1
>      ../t/cpan/libnet/t/smtp_ipv6.t.......... ........................................ FAILED--no leader found
>      ../t/cpan/ExtUtils-MakeMaker/t/vstrings.t ............................. FAILED at test 2
>      ../t/cpan/Encode/t/cow.t................ .............................................. FAILED at test 1
>      ../t/cpan/Unicode-Normalize/t/test.t.... .................................. FAILED at test 8
>      ../t/cpan/ExtUtils-MakeMaker/t/recurs.t. ............................... FAILED at test 3
>      ../t/cpan/HTTP-Tiny/t/170_keepalive.t... ................................. FAILED at test 1
>      ../t/cpan/IO-Compress/t/102tied-bzip2.t. ............................... FAILED at test 18
>      ../t/cpan/libnet/t/smtp.t............... ............................................. FAILED--no leader found
>      ../t/cpan/Unicode-Normalize/t/null.t.... .................................. FAILED at test 3
>      ../t/cpan/Pod-Simple/t/render.t......... ....................................... FAILED--expected test 23, saw test 25
>      ../t/cpan/podlators/t/man-empty.t....... ..................................... FAILED at test 3
>      ../t/cpan/libnet/t/nntp_ssl.t........... ......................................... FAILED--no leader found
>      ../t/cpan/HTTP-Tiny/t/161_basic_auth.t.. ................................ FAILED at test 1
>      ../t/cpan/HTTP-Tiny/t/130_redirect.t.... .................................. FAILED at test 1
>      ../t/cpan/CPAN-Meta/t/merge.t........... ......................................... FAILED--no leader found
>      ../t/cpan/JSON-PP/t/018_json_checker.t.. ................................ FAILED at test 34
>      ../t/cpan/Pod-Simple/t/output.t......... ....................................... FAILED at test 32
>      ../t/cpan/Pod-Simple/t/search28.t....... ..................................... FAILED at test 3
>      ../t/cpan/JSON-PP/t/112_upgrade.t....... ..................................... FAILED at test 1
>      ../t/cpan/IO-Compress/t/101truncate-rawdeflate.t ...................... FAILED--expected 625 tests, saw 635
>      ../t/cpan/libnet/t/pop3_ipv6.t.......... ........................................ FAILED--no leader found
>      ../t/cpan/JSON-PP/t/001_utf8.t.......... ........................................ FAILED at test 1
>      ../t/dist/ExtUtils-CBuilder/t/04-base.t. ............................... FAILED at test 44
>      ../t/cpan/JSON-PP/t/009_pc_extra_number.t ............................. FAILED--expected 6 tests, saw 0
>      ../t/cpan/HTTP-Tiny/t/103_delete.t...... .................................... FAILED at test 1
>      ../t/cpan/JSON-PP/t/106_allow_barekey.t. ............................... FAILED--expected 2 tests, saw 1
>      ../t/cpan/Unicode-Normalize/t/fcdc.t.... .................................. FAILED at test 20
>      ../ext/POSIX/t/sigaction.t.............. .......................................... FAILED--expected 33 tests, saw 30
>      ../t/cpan/JSON-PP/t/007_pc_esc.t........ ...................................... FAILED at test 1
>      ../t/porting/readme.t................... ............................................... FAILED at test 70
>      ../t/cpan/ExtUtils-MakeMaker/t/pm.t..... ................................... FAILED--expected 6 tests, saw 5
>      ../t/cpan/Pod-Simple/t/corpus.t......... ....................................... FAILED at test 2
>      ../t/dist/Data-Dumper/t/dumper.t........ ...................................... FAILED--expected 438 tests, saw 0
>      ../t/cpan/Pod-Simple/t/for.t............ .......................................... FAILED at test 8
>      ../t/cpan/podlators/t/man.t............. ........................................... FAILED at test 3
>      ../t/cpan/HTTP-Tiny/t/160_cookies.t..... ................................... FAILED at test 1
>      ../t/cpan/Socket/t/getnameinfo.t........ ...................................... FAILED at test 6
>      ../t/cpan/Digest-SHA/t/fips198.t........ ...................................... FAILED at test 1
>      ../t/cpan/CPAN-Meta/t/converter-fail.t.. ................................ FAILED--no leader found
>      ../t/cpan/Archive-Tar/t/02_methods.t.... .................................. FAILED at test 20
>      ../t/cpan/CPAN-Meta/t/converter-fragments.t ........................... FAILED--no leader found
>      ../t/cpan/IO-Compress/t/101truncate-bzip2.t ........................... FAILED--expected 4012 tests, saw 0
>      ../t/cpan/CPAN-Meta-YAML/t/31_local_tml.t ............................. FAILED--no leader found
>      ../t/cpan/Pod-Simple/t/fcodes_s.t....... ..................................... FAILED at test 13
>      ../t/cpan/JSON-PP/t/014_latin1.t........ ...................................... FAILED at test 1
>      ../t/cpan/CPAN-Meta/t/no-index.t........ ...................................... FAILED--no leader found
>      ../t/cpan/File-Temp/t/tempfile.t........ ...................................... FAILED at test 19
>      ../t/cpan/Digest-SHA/t/fips180-4.t...... .................................... FAILED at test 1
>      ../t/cpan/Pod-Simple/t/fornot.t......... ....................................... FAILED at test 16
>      ../t/cpan/JSON-PP/t/019_incr.t.......... ........................................ FAILED--expected 697 tests, saw 0
>      ../t/cpan/CPAN-Meta-YAML/t/10_read.t.... .................................. FAILED at test 1
>      ../t/cpan/Pod-Simple/t/search20.t....... ..................................... FAILED at test 3
>      ../t/cpan/Pod-Simple/t/ac_d.t........... ......................................... FAILED at test 9
>      ../t/cpan/Pod-Simple/t/search26.t....... ..................................... FAILED at test 3
>      ../t/cpan/ExtUtils-MakeMaker/t/min_perl_version.t ..................... FAILED at test 4
>      ../t/cpan/Module-Metadata/t/encoding.t.. ................................ FAILED at test 1
>      ../lib/open.t........................... ....................................................... FAILED at test 24
>      ../t/cpan/ExtUtils-MakeMaker/t/basic.t.. ................................ FAILED at test 3
>      ../t/cpan/JSON-PP/t/008_pc_base.t....... ..................................... FAILED--expected 20 tests, saw 2
>      ../t/cpan/ExtUtils-MakeMaker/t/PL_FILES.t ............................. FAILED at test 2
>      ../t/cpan/IO-Compress/t/106prime-bzip2.t .............................. FAILED--no leader found
>      ../t/cpan/Encode/t/grow.t............... ............................................. FAILED at test 2
>      ../t/cpan/JSON-PP/t/002_error.t......... ....................................... FAILED at test 23
>      ../t/cpan/ExtUtils-MakeMaker/t/prereq.t. ............................... FAILED--expected 16 tests, saw 5
>      ../t/cpan/MIME-Base64/t/unicode.t....... ..................................... FAILED at test 5
>      ../t/cpan/Test-Harness/t/yamlish-writer.t ............................. FAILED at test 16
>      ../t/cpan/JSON-PP/t/zero-mojibake.t..... ................................... FAILED at test 1
>      ../t/cpan/CPAN-Meta/t/load-bad.t........ ...................................... FAILED at test 1
>      ../t/cpan/HTTP-Tiny/t/020_headers.t..... ................................... FAILED at test 1
>      ../t/cpan/HTTP-Tiny/t/050_chunked_body.t .............................. FAILED--non-zero wait status: 65280
>      ../t/cpan/HTTP-Tiny/t/162_proxy_auth.t.. ................................ FAILED at test 1
>      ../t/cpan/ExtUtils-MakeMaker/t/several_authors.t ...................... FAILED at test 4
>      ../t/cpan/CPAN-Meta/t/validator.t....... ..................................... FAILED--no leader found
>      ../t/cpan/Pod-Simple/t/x_nixer.t........ ...................................... FAILED at test 8
>      ../t/cpan/libnet/t/nntp_ipv6.t.......... ........................................ FAILED--no leader found
>      ../t/cpan/JSON-PP/t/109_encode.t........ ...................................... FAILED at test 2
>      ../t/cpan/CPAN-Meta-YAML/t/32_world_tml.t ............................. FAILED--no leader found
>      ../t/cpan/libnet/t/pop3_ssl.t........... ......................................... FAILED--no leader found
>      ../t/cpan/JSON-PP/t/116_incr_parse_fixed.t ............................ FAILED--expected 4 tests, saw 1
>      ../t/cpan/podlators/t/color.t........... ......................................... FAILED at test 3
>      ../t/cpan/Pod-Simple/t/fcodes.t......... ....................................... FAILED at test 17
>      ../t/cpan/Digest-SHA/t/sha1.t........... ......................................... FAILED at test 1
>      ../t/cpan/Test-Harness/t/harness.t...... .................................... FAILED at test 103
>      ../t/cpan/MIME-Base64/t/base64.t........ ...................................... FAILED at test 261
>      ../t/cpan/Pod-Simple/t/xhtml01.t........ ...................................... FAILED at test 39
>      ../t/cpan/MIME-Base64/t/quoted-print.t.. ................................ FAILED at test 2
>      ../t/cpan/Pod-Simple/t/pulltitl.t....... ..................................... FAILED--expected 117 tests, saw 69
>      ../t/cpan/HTTP-Tiny/t/100_get.t......... ....................................... FAILED at test 3
>      ../t/cpan/Digest-SHA/t/rfc2202.t........ ...................................... FAILED at test 1
>      ../t/cpan/CPAN-Meta/t/optional_feature-merge.t ........................ FAILED--no leader found
>      ../t/op/stat.t.......................... ...................................................... FAILED at test 2
>      ../t/cpan/ExtUtils-MakeMaker/t/xs.t..... ................................... FAILED--no leader found
>      ../t/cpan/ExtUtils-MakeMaker/t/INST_PREFIX.t .......................... FAILED--expected 52 tests, saw 4
>      ../t/cpan/Digest-SHA/t/sha256.t......... ....................................... FAILED at test 1
>      ../t/cpan/Digest-SHA/t/sha224.t......... ....................................... FAILED at test 1
>      ../t/cpan/CPAN-Meta-YAML/t/21_yamlpm_compat.t ......................... FAILED--no leader found
>      ../t/cpan/CPAN-Meta-YAML/t/30_yaml_spec_tml.t ......................... FAILED at test 1
>      ../t/cpan/ExtUtils-MakeMaker/t/meta_convert.t ......................... FAILED at test 2
>      ../t/cpan/Archive-Tar/t/05_iter.t....... ..................................... FAILED at test 4
>      ../t/cpan/File-Temp/t/security.t........ ...................................... FAILED at test 9
>      ../t/cpan/CPAN-Meta/t/repository.t...... .................................... FAILED--no leader found
>      ../lib/h2ph.t........................... ....................................................... FAILED at test 1
>      ../t/cpan/HTTP-Tiny/t/030_response.t.... .................................. FAILED--no leader found
>      ../t/cpan/CPAN-Meta-YAML/t/11_read_string.t ........................... FAILED--no leader found
>      ../t/cpan/CPAN-Meta/t/meta-obj.t........ ...................................... FAILED--no leader found
>      ../t/cpan/CPAN-Meta/t/save-load.t....... ..................................... FAILED--no leader found
>      ../t/cpan/JSON-PP/t/012_blessed.t....... ..................................... FAILED--expected 16 tests, saw 8
>      ../t/cpan/Digest-SHA/t/ireland.t........ ...................................... FAILED at test 1
>      ../t/cpan/ExtUtils-MakeMaker/t/metafile_data.t ........................ FAILED at test 14
>      ../t/cpan/Unicode-Normalize/t/func.t.... .................................. FAILED at test 10
>      ../t/cpan/Pod-Usage/t/pod/pod2usage2.t.. ................................ FAILED at test 3
>      ../t/cpan/libnet/t/smtp_ssl.t........... ......................................... FAILED--no leader found
>      ../t/cpan/Parse-CPAN-Meta/t/03_functions.t ............................ FAILED--expected 2 tests, saw 0
>      ../t/dist/Net-Ping/t/450_service.t...... .................................... FAILED at test 9
>      ../t/cpan/podlators/t/termcap.t......... ....................................... FAILED at test 3
>      ../t/cpan/ExtUtils-MakeMaker/t/build_man.t ............................ FAILED--expected 9 tests, saw 5
>      ../t/cpan/ExtUtils-MakeMaker/t/writemakefile_args.t ................... FAILED at test 4
>      ../t/cpan/podlators/t/basic.t........... ......................................... FAILED at test 6
>      ../t/cpan/Pod-Simple/t/search12.t....... ..................................... FAILED at test 3
>      ../t/cpan/ExtUtils-MakeMaker/t/pm_to_blib.t ........................... FAILED at test 3
>      ../t/cpan/IO-Compress/t/001bzip2.t...... .................................... FAILED at test 58
>      ../t/cpan/Pod-Simple/t/encod04.t........ ...................................... FAILED at test 2
>      ../t/cpan/Digest-SHA/t/unicode.t........ ...................................... FAILED at test 1
>      ../t/cpan/Unicode-Collate/t/normal.t.... .................................. FAILED at test 11
>      ../t/cpan/PerlIO-via-QuotedPrint/t/QuotedPrint.t ...................... FAILED--seen duplicate leader
>      ../t/cpan/Pod-Simple/t/reinit.t......... ....................................... FAILED--expected 5 tests, saw 4
>      ../t/cpan/Text-Balanced/t/06_extqlk.t... ................................. FAILED at test 50
>      ../t/cpan/podlators/t/text-empty.t...... .................................... FAILED at test 3
>      ../t/cpan/CPAN-Meta-YAML/t/12_write.t... ................................. FAILED--no leader found
>      ../t/cpan/Digest-SHA/t/sha512.t......... ....................................... FAILED at test 1
>      ../t/cpan/File-Temp/t/object.t.......... ........................................ FAILED at test 8
>      ../t/cpan/ExtUtils-MakeMaker/t/postamble.t ............................ FAILED--expected 8 tests, saw 4
>      ../t/cpan/ExtUtils-MakeMaker/t/WriteEmptyMakefile.t ................... FAILED--expected 5 tests, saw 4
>      ../t/cpan/Pod-Simple/t/begin.t.......... ........................................ FAILED at test 26
>      ../t/cpan/HTTP-Tiny/t/110_mirror.t...... .................................... FAILED at test 1
>      ../t/cpan/ExtUtils-MakeMaker/t/unicode.t .............................. FAILED--expected 9 tests, saw 4
>      ../t/cpan/Pod-Simple/t/htmlbat.t........ ...................................... FAILED--expected 17 tests, saw 2
>      ../t/cpan/Archive-Tar/t/04_resolved_issues.t .......................... FAILED at test 38
>      ../t/cpan/Unicode-Normalize/t/norm.t.... .................................. FAILED at test 8
>      ../t/cpan/ExtUtils-MakeMaker/t/INST.t... ................................. FAILED--expected 26 tests, saw 4
>      ../t/cpan/ExtUtils-Manifest/t/Manifest.t .............................. FAILED at test 43
>      ../t/cpan/Pod-Simple/t/fcodes_l.t....... ..................................... FAILED at test 6
>      ../t/cpan/HTTP-Tiny/t/150_post_form.t... ................................. FAILED at test 1
>      ../t/cpan/Encode/t/decode.t............. ........................................... FAILED at test 1
>      ../t/cpan/podlators/t/text.t............ .......................................... FAILED at test 5
>      ../t/cpan/ExtUtils-MakeMaker/t/VERSION_FROM.t ......................... FAILED--expected 1 tests, saw 0
>      ../t/cpan/IO-Compress/t/104destroy-bzip2.t ............................ FAILED--expected 15 tests, saw 4
>      ../t/cpan/HTTP-Tiny/t/104_post.t........ ...................................... FAILED at test 1
>      ../t/cpan/JSON-PP/t/022_comment_at_eof.t .............................. FAILED at test 13
>      ../t/cpan/ExtUtils-MakeMaker/t/FIRST_MAKEFILE.t ....................... FAILED at test 3
>      ../t/cpan/Digest-SHA/t/state.t.......... ........................................ FAILED at test 1
>      ../t/cpan/JSON-PP/t/099_binary.t........ ...................................... FAILED--expected 2432 tests, saw 0
>      ../t/cpan/JSON-PP/t/003_types.t......... ....................................... FAILED--expected 76 tests, saw 18
>      ../t/cpan/HTTP-Tiny/t/101_head.t........ ...................................... FAILED at test 1
>      ../t/cpan/IPC-Cmd/t/03_run-forked.t..... ................................... FAILED at test 3
>      ../t/cpan/Pod-Simple/t/search22.t....... ..................................... FAILED at test 3
>      ../t/cpan/IO-Compress/t/107multi-bzip2.t .............................. FAILED at test 8
>      ../t/cpan/JSON-PP/t/017_relaxed.t....... ..................................... FAILED--expected 8 tests, saw 4
>      ../t/cpan/HTTP-Tiny/t/102_put.t......... ....................................... FAILED at test 1
>      ../t/cpan/podlators/t/text-encoding.t... ................................. FAILED at test 3
>      ../t/cpan/JSON-PP/t/114_decode_prefix.t. ............................... FAILED--expected 8 tests, saw 0
>      ../t/cpan/Unicode-Collate/t/nonchar.t... ................................. FAILED at test 52
>      ../t/cpan/IO-Compress/t/105oneshot-bzip2.t ............................ FAILED--expected 1002 tests, saw 117
>      ../t/cpan/Digest-SHA/t/sha384.t......... ....................................... FAILED at test 1
>      ../t/op/pack.t.......................... ...................................................... FAILED at test 4174
>      ../t/cpan/IO-Compress/t/100generic-bzip2.t ............................ FAILED at test 36
>      ../t/cpan/CPAN-Meta/t/converter.t....... ..................................... FAILED--no leader found
>      ../t/cpan/Parse-CPAN-Meta/t/02_api.t.... .................................. FAILED--non-zero wait status: 256
>      ../t/cpan/JSON-PP/t/108_decode.t........ ...................................... FAILED--expected 6 tests, saw 0
>      ../t/cpan/Test-Harness/t/yamlish.t...... .................................... FAILED at test 44
>      ../t/cpan/IO-Compress/t/103newtied-bzip2.t ............................ FAILED at test 15
>      ../t/cpan/Digest-SHA/t/methods.t........ ...................................... FAILED at test 2
>      ../t/run/locale.t....................... ................................................... FAILED at test 30
>      ../t/cpan/Digest-SHA/t/base64.t......... ....................................... FAILED at test 1
>      ../t/cpan/Encode/t/gsm0338.t............ .......................................... FAILED at test 11
>      ../t/cpan/JSON-PP/t/021_evans_bugrep.t.. ................................ FAILED--expected 6 tests, saw 2
>
> [perlio]
> Inconsistent test results (between TEST and harness):
>      ../t/cpan/ExtUtils-MakeMaker/t/pm_to_blib.t ........................... FAILED at test 3
>      ../t/cpan/Pod-Simple/t/search12.t....... ..................................... FAILED at test 3
>      ../t/cpan/podlators/t/basic.t........... ......................................... FAILED at test 6
>      ../t/cpan/Pod-Simple/t/reinit.t......... ....................................... FAILED--expected 5 tests, saw 4
>      ../t/cpan/PerlIO-via-QuotedPrint/t/QuotedPrint.t ...................... FAILED--seen duplicate leader
>      ../t/cpan/Digest-SHA/t/unicode.t........ ...................................... FAILED at test 1
>      ../t/cpan/Unicode-Collate/t/normal.t.... .................................. FAILED at test 11
>      ../t/cpan/IO-Compress/t/001bzip2.t...... .................................... FAILED at test 58
>      ../t/cpan/Pod-Simple/t/encod04.t........ ...................................... FAILED at test 2
>      ../t/cpan/ExtUtils-MakeMaker/t/build_man.t ............................ FAILED--expected 9 tests, saw 5
>      ../t/cpan/podlators/t/termcap.t......... ....................................... FAILED at test 3
>      ../t/dist/Net-Ping/t/450_service.t...... .................................... FAILED at test 9
>      ../t/cpan/ExtUtils-MakeMaker/t/writemakefile_args.t ................... FAILED at test 4
>      ../t/cpan/HTTP-Tiny/t/150_post_form.t... ................................. FAILED at test 1
>      ../t/cpan/Pod-Simple/t/fcodes_l.t....... ..................................... FAILED at test 6
>      ../t/cpan/ExtUtils-Manifest/t/Manifest.t .............................. FAILED at test 43
>      ../t/cpan/ExtUtils-MakeMaker/t/INST.t... ................................. FAILED--expected 26 tests, saw 4
>      ../t/cpan/Unicode-Normalize/t/norm.t.... .................................. FAILED at test 8
>      ../t/cpan/Archive-Tar/t/04_resolved_issues.t .......................... FAILED at test 38
>      ../t/cpan/Pod-Simple/t/htmlbat.t........ ...................................... FAILED--expected 17 tests, saw 2
>      ../t/cpan/podlators/t/text.t............ .......................................... FAILED at test 5
>      ../t/cpan/Encode/t/decode.t............. ........................................... FAILED at test 1
>      ../t/cpan/ExtUtils-MakeMaker/t/WriteEmptyMakefile.t ................... FAILED--expected 5 tests, saw 4
>      ../t/cpan/ExtUtils-MakeMaker/t/postamble.t ............................ FAILED--expected 8 tests, saw 4
>      ../t/cpan/File-Temp/t/object.t.......... ........................................ FAILED at test 8
>      ../t/cpan/CPAN-Meta-YAML/t/12_write.t... ................................. FAILED--no leader found
>      ../t/cpan/Digest-SHA/t/sha512.t......... ....................................... FAILED at test 1
>      ../t/cpan/podlators/t/text-empty.t...... .................................... FAILED at test 3
>      ../t/cpan/Text-Balanced/t/06_extqlk.t... ................................. FAILED at test 50
>      ../t/cpan/ExtUtils-MakeMaker/t/unicode.t .............................. FAILED--expected 9 tests, saw 4
>      ../t/cpan/HTTP-Tiny/t/110_mirror.t...... .................................... FAILED at test 1
>      ../t/cpan/Pod-Simple/t/begin.t.......... ........................................ FAILED at test 26
>      ../t/cpan/JSON-PP/t/022_comment_at_eof.t .............................. FAILED at test 13
>      ../t/cpan/IO-Compress/t/107multi-bzip2.t .............................. FAILED at test 8
>      ../t/cpan/Pod-Simple/t/search22.t....... ..................................... FAILED at test 3
>      ../t/cpan/HTTP-Tiny/t/101_head.t........ ...................................... FAILED at test 1
>      ../t/cpan/IPC-Cmd/t/03_run-forked.t..... ................................... FAILED at test 3
>      ../t/cpan/JSON-PP/t/099_binary.t........ ...................................... FAILED--expected 2432 tests, saw 0
>      ../t/cpan/JSON-PP/t/003_types.t......... ....................................... FAILED--expected 76 tests, saw 18
>      ../t/cpan/ExtUtils-MakeMaker/t/FIRST_MAKEFILE.t ....................... FAILED at test 3
>      ../t/cpan/Digest-SHA/t/state.t.......... ........................................ FAILED at test 1
>      ../t/cpan/IO-Compress/t/104destroy-bzip2.t ............................ FAILED--expected 15 tests, saw 4
>      ../t/cpan/HTTP-Tiny/t/104_post.t........ ...................................... FAILED at test 1
>      ../t/cpan/ExtUtils-MakeMaker/t/VERSION_FROM.t ......................... FAILED--expected 1 tests, saw 0
>      ../t/run/locale.t....................... ................................................... FAILED at test 30
>      ../t/cpan/Digest-SHA/t/methods.t........ ...................................... FAILED at test 2
>      ../t/cpan/IO-Compress/t/103newtied-bzip2.t ............................ FAILED at test 15
>      ../t/cpan/Test-Harness/t/yamlish.t...... .................................... FAILED at test 44
>      ../t/cpan/JSON-PP/t/021_evans_bugrep.t.. ................................ FAILED--expected 6 tests, saw 2
>      ../t/cpan/Encode/t/gsm0338.t............ .......................................... FAILED at test 11
>      ../t/cpan/Digest-SHA/t/base64.t......... ....................................... FAILED at test 1
>      ../t/cpan/CPAN-Meta/t/converter.t....... ..................................... FAILED--no leader found
>      ../t/cpan/IO-Compress/t/100generic-bzip2.t ............................ FAILED at test 36
>      ../t/cpan/IO-Compress/t/105oneshot-bzip2.t ............................ FAILED--expected 1002 tests, saw 117
>      ../t/op/pack.t.......................... ...................................................... FAILED at test 4174
>      ../t/cpan/Digest-SHA/t/sha384.t......... ....................................... FAILED at test 1
>      ../t/cpan/Unicode-Collate/t/nonchar.t... ................................. FAILED at test 52
>      ../t/cpan/JSON-PP/t/114_decode_prefix.t. ............................... FAILED--expected 8 tests, saw 0
>      ../t/cpan/podlators/t/text-encoding.t... ................................. FAILED at test 3
>      ../t/cpan/HTTP-Tiny/t/102_put.t......... ....................................... FAILED at test 1
>      ../t/cpan/JSON-PP/t/017_relaxed.t....... ..................................... FAILED--expected 8 tests, saw 4
>      ../t/cpan/JSON-PP/t/108_decode.t........ ...................................... FAILED--expected 6 tests, saw 0
>      ../t/cpan/Parse-CPAN-Meta/t/02_api.t.... .................................. FAILED--non-zero wait status: 256
>      ../t/cpan/libnet/t/nntp_ipv6.t.......... ........................................ FAILED--no leader found
>      ../t/cpan/Pod-Simple/t/x_nixer.t........ ...................................... FAILED at test 8
>      ../t/cpan/ExtUtils-MakeMaker/t/several_authors.t ...................... FAILED at test 4
>      ../t/cpan/CPAN-Meta/t/validator.t....... ..................................... FAILED--no leader found
>      ../t/cpan/libnet/t/pop3_ssl.t........... ......................................... FAILED--no leader found
>      ../t/cpan/JSON-PP/t/116_incr_parse_fixed.t ............................ FAILED--expected 4 tests, saw 1
>      ../t/cpan/CPAN-Meta-YAML/t/32_world_tml.t ............................. FAILED--no leader found
>      ../t/cpan/JSON-PP/t/109_encode.t........ ...................................... FAILED at test 2
>      ../t/cpan/HTTP-Tiny/t/050_chunked_body.t .............................. FAILED--non-zero wait status: 65280
>      ../t/cpan/HTTP-Tiny/t/020_headers.t..... ................................... FAILED at test 1
>      ../t/cpan/HTTP-Tiny/t/162_proxy_auth.t.. ................................ FAILED at test 1
>      ../t/cpan/MIME-Base64/t/quoted-print.t.. ................................ FAILED at test 2
>      ../t/cpan/HTTP-Tiny/t/100_get.t......... ....................................... FAILED at test 3
>      ../t/cpan/Pod-Simple/t/pulltitl.t....... ..................................... FAILED--expected 117 tests, saw 69
>      ../t/cpan/MIME-Base64/t/base64.t........ ...................................... FAILED at test 261
>      ../t/cpan/Test-Harness/t/harness.t...... .................................... FAILED at test 103
>      ../t/cpan/podlators/t/color.t........... ......................................... FAILED at test 3
>      ../t/cpan/Digest-SHA/t/sha1.t........... ......................................... FAILED at test 1
>      ../t/cpan/Pod-Simple/t/fcodes.t......... ....................................... FAILED at test 17
>      ../t/cpan/Pod-Simple/t/xhtml01.t........ ...................................... FAILED at test 39
>      ../t/cpan/Digest-SHA/t/sha224.t......... ....................................... FAILED at test 1
>      ../t/cpan/ExtUtils-MakeMaker/t/meta_convert.t ......................... FAILED at test 2
>      ../t/cpan/CPAN-Meta-YAML/t/30_yaml_spec_tml.t ......................... FAILED at test 1
>      ../t/cpan/CPAN-Meta-YAML/t/21_yamlpm_compat.t ......................... FAILED--no leader found
>      ../t/cpan/CPAN-Meta/t/optional_feature-merge.t ........................ FAILED--no leader found
>      ../t/cpan/Digest-SHA/t/rfc2202.t........ ...................................... FAILED at test 1
>      ../t/cpan/ExtUtils-MakeMaker/t/INST_PREFIX.t .......................... FAILED--expected 52 tests, saw 4
>      ../t/cpan/Digest-SHA/t/sha256.t......... ....................................... FAILED at test 1
>      ../t/op/stat.t.......................... ...................................................... FAILED at test 2
>      ../t/cpan/ExtUtils-MakeMaker/t/xs.t..... ................................... FAILED--no leader found
>      ../t/cpan/ExtUtils-MakeMaker/t/metafile_data.t ........................ FAILED at test 14
>      ../t/cpan/JSON-PP/t/012_blessed.t....... ..................................... FAILED--expected 16 tests, saw 8
>      ../t/cpan/Digest-SHA/t/ireland.t........ ...................................... FAILED at test 1
>      ../t/cpan/CPAN-Meta/t/save-load.t....... ..................................... FAILED--no leader found
>      ../t/cpan/Parse-CPAN-Meta/t/03_functions.t ............................ FAILED--expected 2 tests, saw 0
>      ../t/cpan/Pod-Usage/t/pod/pod2usage2.t.. ................................ FAILED at test 3
>      ../t/cpan/Unicode-Normalize/t/func.t.... .................................. FAILED at test 10
>      ../t/cpan/libnet/t/smtp_ssl.t........... ......................................... FAILED--no leader found
>      ../lib/h2ph.t........................... ....................................................... FAILED at test 1
>      ../t/cpan/CPAN-Meta/t/repository.t...... .................................... FAILED--no leader found
>      ../t/cpan/File-Temp/t/security.t........ ...................................... FAILED at test 9
>      ../t/cpan/Archive-Tar/t/05_iter.t....... ..................................... FAILED at test 4
>      ../t/cpan/CPAN-Meta-YAML/t/11_read_string.t ........................... FAILED--no leader found
>      ../t/cpan/CPAN-Meta/t/meta-obj.t........ ...................................... FAILED--no leader found
>      ../t/cpan/HTTP-Tiny/t/030_response.t.... .................................. FAILED--no leader found
>      ../t/cpan/Pod-Simple/t/corpus.t......... ....................................... FAILED at test 2
>      ../t/porting/readme.t................... ............................................... FAILED at test 70
>      ../t/cpan/ExtUtils-MakeMaker/t/pm.t..... ................................... FAILED--expected 6 tests, saw 5
>      ../t/cpan/Pod-Simple/t/for.t............ .......................................... FAILED at test 8
>      ../t/dist/Data-Dumper/t/dumper.t........ ...................................... FAILED--expected 438 tests, saw 0
>      ../t/cpan/Unicode-Normalize/t/fcdc.t.... .................................. FAILED at test 20
>      ../t/cpan/JSON-PP/t/007_pc_esc.t........ ...................................... FAILED at test 1
>      ../ext/POSIX/t/sigaction.t.............. .......................................... FAILED--expected 33 tests, saw 30
>      ../t/cpan/Digest-SHA/t/fips180-4.t...... .................................... FAILED at test 1
>      ../t/cpan/File-Temp/t/tempfile.t........ ...................................... FAILED at test 19
>      ../t/cpan/Pod-Simple/t/fcodes_s.t....... ..................................... FAILED at test 13
>      ../t/cpan/CPAN-Meta/t/no-index.t........ ...................................... FAILED--no leader found
>      ../t/cpan/JSON-PP/t/014_latin1.t........ ...................................... FAILED at test 1
>      ../t/cpan/JSON-PP/t/019_incr.t.......... ........................................ FAILED--expected 697 tests, saw 0
>      ../t/cpan/Pod-Simple/t/fornot.t......... ....................................... FAILED at test 16
>      ../t/cpan/CPAN-Meta/t/converter-fail.t.. ................................ FAILED--no leader found
>      ../t/cpan/Digest-SHA/t/fips198.t........ ...................................... FAILED at test 1
>      ../t/cpan/Socket/t/getnameinfo.t........ ...................................... FAILED at test 6
>      ../t/cpan/HTTP-Tiny/t/160_cookies.t..... ................................... FAILED at test 1
>      ../t/cpan/podlators/t/man.t............. ........................................... FAILED at test 3
>      ../t/cpan/CPAN-Meta-YAML/t/31_local_tml.t ............................. FAILED--no leader found
>      ../t/cpan/IO-Compress/t/101truncate-bzip2.t ........................... FAILED--expected 4012 tests, saw 0
>      ../t/cpan/CPAN-Meta/t/converter-fragments.t ........................... FAILED--no leader found
>      ../t/cpan/Archive-Tar/t/02_methods.t.... .................................. FAILED at test 20
>      ../lib/open.t........................... ....................................................... FAILED at test 24
>      ../t/cpan/Pod-Simple/t/search20.t....... ..................................... FAILED at test 3
>      ../t/cpan/CPAN-Meta-YAML/t/10_read.t.... .................................. FAILED at test 1
>      ../t/cpan/Module-Metadata/t/encoding.t.. ................................ FAILED at test 1
>      ../t/cpan/ExtUtils-MakeMaker/t/min_perl_version.t ..................... FAILED at test 4
>      ../t/cpan/Pod-Simple/t/search26.t....... ..................................... FAILED at test 3
>      ../t/cpan/Pod-Simple/t/ac_d.t........... ......................................... FAILED at test 9
>      ../t/cpan/MIME-Base64/t/unicode.t....... ..................................... FAILED at test 5
>      ../t/cpan/ExtUtils-MakeMaker/t/prereq.t. ............................... FAILED--expected 16 tests, saw 5
>      ../t/cpan/JSON-PP/t/002_error.t......... ....................................... FAILED at test 23
>      ../t/cpan/CPAN-Meta/t/load-bad.t........ ...................................... FAILED at test 1
>      ../t/cpan/JSON-PP/t/zero-mojibake.t..... ................................... FAILED at test 1
>      ../t/cpan/Test-Harness/t/yamlish-writer.t ............................. FAILED at test 16
>      ../t/cpan/ExtUtils-MakeMaker/t/PL_FILES.t ............................. FAILED at test 2
>      ../t/cpan/JSON-PP/t/008_pc_base.t....... ..................................... FAILED--expected 20 tests, saw 2
>      ../t/cpan/ExtUtils-MakeMaker/t/basic.t.. ................................ FAILED at test 3
>      ../t/cpan/Encode/t/grow.t............... ............................................. FAILED at test 2
>      ../t/cpan/IO-Compress/t/106prime-bzip2.t .............................. FAILED--no leader found
>      ../t/cpan/Encode/t/jis7-fallback.t...... .................................... FAILED--no leader found
>      ../t/cpan/ExtUtils-MakeMaker/t/miniperl.t ............................. FAILED at test 3
>      ../t/cpan/IPC-Cmd/t/01_IPC-Cmd.t........ ...................................... FAILED at test 460
>      ../t/cpan/JSON-PP/t/107_allow_singlequote.t ........................... FAILED--expected 4 tests, saw 1
>      ../t/cpan/Pod-Simple/t/search10.t....... ..................................... FAILED at test 3
>      ../t/cpan/CPAN-Meta/t/converter-bad.t... ................................. FAILED--no leader found
>      ../t/cpan/libnet/t/smtp_ipv6.t.......... ........................................ FAILED--no leader found
>      ../t/cpan/Digest-SHA/t/woodbury.t....... ..................................... FAILED at test 1
>      ../t/cpan/IO-Compress/t/110encode-bzip2.t ............................. FAILED at test 2
>      ../t/cpan/Unicode-Normalize/t/test.t.... .................................. FAILED at test 8
>      ../t/cpan/Encode/t/cow.t................ .............................................. FAILED at test 1
>      ../t/cpan/ExtUtils-MakeMaker/t/vstrings.t ............................. FAILED at test 2
>      ../t/cpan/Devel-PPPort/t/pv_tools.t..... ................................... FAILED at test 7
>      ../t/cpan/Digest-SHA/t/hmacsha.t........ ...................................... FAILED at test 1
>      ../t/cpan/IO-Compress/t/108anyunc-bzip2.t ............................. FAILED at test 5
>      ../t/cpan/Test-Harness/t/yamlish-output.t ............................. FAILED at test 3
>      ../t/cpan/ExtUtils-MakeMaker/t/INSTALL_BASE.t ......................... FAILED at test 3
>      ../t/cpan/libnet/t/nntp_ssl.t........... ......................................... FAILED--no leader found
>      ../t/cpan/podlators/t/man-empty.t....... ..................................... FAILED at test 3
>      ../t/cpan/Pod-Simple/t/render.t......... ....................................... FAILED--expected test 23, saw test 25
>      ../t/cpan/Unicode-Normalize/t/null.t.... .................................. FAILED at test 3
>      ../t/cpan/libnet/t/smtp.t............... ............................................. FAILED--no leader found
>      ../t/cpan/CPAN-Meta/t/merge.t........... ......................................... FAILED--no leader found
>      ../t/cpan/HTTP-Tiny/t/130_redirect.t.... .................................. FAILED at test 1
>      ../t/cpan/HTTP-Tiny/t/161_basic_auth.t.. ................................ FAILED at test 1
>      ../t/cpan/HTTP-Tiny/t/170_keepalive.t... ................................. FAILED at test 1
>      ../t/cpan/ExtUtils-MakeMaker/t/recurs.t. ............................... FAILED at test 3
>      ../t/cpan/IO-Compress/t/102tied-bzip2.t. ............................... FAILED at test 18
>      ../t/cpan/JSON-PP/t/009_pc_extra_number.t ............................. FAILED--expected 6 tests, saw 0
>      ../t/dist/ExtUtils-CBuilder/t/04-base.t. ............................... FAILED at test 44
>      ../t/cpan/JSON-PP/t/106_allow_barekey.t. ............................... FAILED--expected 2 tests, saw 1
>      ../t/cpan/HTTP-Tiny/t/103_delete.t...... .................................... FAILED at test 1
>      ../t/cpan/Pod-Simple/t/search28.t....... ..................................... FAILED at test 3
>      ../t/cpan/Pod-Simple/t/output.t......... ....................................... FAILED at test 32
>      ../t/cpan/JSON-PP/t/018_json_checker.t.. ................................ FAILED at test 34
>      ../t/cpan/libnet/t/pop3_ipv6.t.......... ........................................ FAILED--no leader found
>      ../t/cpan/IO-Compress/t/101truncate-rawdeflate.t ...................... FAILED--expected 625 tests, saw 635
>      ../t/cpan/JSON-PP/t/001_utf8.t.......... ........................................ FAILED at test 1
>      ../t/cpan/JSON-PP/t/112_upgrade.t....... ..................................... FAILED at test 1
>
> [stdio] -DDEBUGGING
> Inconsistent test results (between TEST and harness):
>      ../t/cpan/HTTP-Tiny/t/150_post_form.t... ................................. FAILED at test 1
>      ../t/cpan/ExtUtils-MakeMaker/t/INST.t... ................................. FAILED--expected 26 tests, saw 4
>      ../t/cpan/Pod-Simple/t/fcodes_l.t....... ..................................... FAILED at test 6
>      ../t/cpan/ExtUtils-Manifest/t/Manifest.t .............................. FAILED at test 43
>      ../t/cpan/Archive-Tar/t/04_resolved_issues.t .......................... FAILED at test 38
>      ../t/cpan/Pod-Simple/t/htmlbat.t........ ...................................... FAILED--expected 17 tests, saw 2
>      ../t/cpan/Unicode-Normalize/t/norm.t.... .................................. FAILED at test 8
>      ../t/cpan/Encode/t/decode.t............. ........................................... FAILED at test 1
>      ../t/cpan/podlators/t/text.t............ .......................................... FAILED at test 5
>      ../t/cpan/File-Temp/t/object.t.......... ........................................ FAILED at test 8
>      ../t/cpan/ExtUtils-MakeMaker/t/WriteEmptyMakefile.t ................... FAILED--expected 5 tests, saw 4
>      ../t/cpan/ExtUtils-MakeMaker/t/postamble.t ............................ FAILED--expected 8 tests, saw 4
>      ../t/cpan/CPAN-Meta-YAML/t/12_write.t... ................................. FAILED--no leader found
>      ../t/cpan/Digest-SHA/t/sha512.t......... ....................................... FAILED at test 1
>      ../t/cpan/podlators/t/text-empty.t...... .................................... FAILED at test 3
>      ../t/cpan/Text-Balanced/t/06_extqlk.t... ................................. FAILED at test 50
>      ../t/cpan/ExtUtils-MakeMaker/t/unicode.t .............................. FAILED--expected 9 tests, saw 4
>      ../t/cpan/HTTP-Tiny/t/110_mirror.t...... .................................... FAILED at test 1
>      ../t/cpan/Pod-Simple/t/begin.t.......... ........................................ FAILED at test 26
>      ../t/cpan/ExtUtils-MakeMaker/t/pm_to_blib.t ........................... FAILED at test 3
>      ../t/cpan/Pod-Simple/t/search12.t....... ..................................... FAILED at test 3
>      ../t/cpan/podlators/t/basic.t........... ......................................... FAILED at test 6
>      ../t/cpan/Pod-Simple/t/reinit.t......... ....................................... FAILED--expected 5 tests, saw 4
>      ../t/cpan/PerlIO-via-QuotedPrint/t/QuotedPrint.t ...................... FAILED--seen duplicate leader
>      ../t/cpan/Unicode-Collate/t/normal.t.... .................................. FAILED at test 11
>      ../t/cpan/Digest-SHA/t/unicode.t........ ...................................... FAILED at test 1
>      ../t/cpan/Pod-Simple/t/encod04.t........ ...................................... FAILED at test 2
>      ../t/cpan/IO-Compress/t/001bzip2.t...... .................................... FAILED at test 58
>      ../t/cpan/ExtUtils-MakeMaker/t/build_man.t ............................ FAILED--expected 9 tests, saw 5
>      ../t/cpan/podlators/t/termcap.t......... ....................................... FAILED at test 3
>      ../t/dist/Net-Ping/t/450_service.t...... .................................... FAILED at test 9
>      ../t/cpan/ExtUtils-MakeMaker/t/writemakefile_args.t ................... FAILED at test 4
>      ../t/run/locale.t....................... ................................................... FAILED at test 30
>      ../t/cpan/Digest-SHA/t/methods.t........ ...................................... FAILED at test 2
>      ../t/cpan/Test-Harness/t/yamlish.t...... .................................... FAILED at test 44
>      ../t/cpan/IO-Compress/t/103newtied-bzip2.t ............................ FAILED at test 15
>      ../t/cpan/JSON-PP/t/021_evans_bugrep.t.. ................................ FAILED--expected 6 tests, saw 2
>      ../t/cpan/Digest-SHA/t/base64.t......... ....................................... FAILED at test 1
>      ../t/cpan/Encode/t/gsm0338.t............ .......................................... FAILED at test 11
>      ../t/cpan/CPAN-Meta/t/converter.t....... ..................................... FAILED--no leader found
>      ../t/cpan/IO-Compress/t/100generic-bzip2.t ............................ FAILED at test 36
>      ../t/cpan/Unicode-Collate/t/nonchar.t... ................................. FAILED at test 52
>      ../t/cpan/JSON-PP/t/114_decode_prefix.t. ............................... FAILED--expected 8 tests, saw 0
>      ../t/op/pack.t.......................... ...................................................... FAILED at test 4174
>      ../t/cpan/Digest-SHA/t/sha384.t......... ....................................... FAILED at test 1
>      ../t/cpan/IO-Compress/t/105oneshot-bzip2.t ............................ FAILED--expected 1002 tests, saw 117
>      ../t/cpan/JSON-PP/t/017_relaxed.t....... ..................................... FAILED--expected 8 tests, saw 4
>      ../t/cpan/podlators/t/text-encoding.t... ................................. FAILED at test 3
>      ../t/cpan/HTTP-Tiny/t/102_put.t......... ....................................... FAILED at test 1
>      ../t/cpan/JSON-PP/t/108_decode.t........ ...................................... FAILED--expected 6 tests, saw 0
>      ../t/cpan/Parse-CPAN-Meta/t/02_api.t.... .................................. FAILED--no leader found
>      ../t/cpan/JSON-PP/t/022_comment_at_eof.t .............................. FAILED at test 13
>      ../t/cpan/IO-Compress/t/107multi-bzip2.t .............................. FAILED at test 8
>      ../t/cpan/IPC-Cmd/t/03_run-forked.t..... ................................... FAILED at test 3
>      ../t/cpan/HTTP-Tiny/t/101_head.t........ ...................................... FAILED at test 1
>      ../t/cpan/Pod-Simple/t/search22.t....... ..................................... FAILED at test 3
>      ../t/cpan/Digest-SHA/t/state.t.......... ........................................ FAILED at test 1
>      ../t/cpan/ExtUtils-MakeMaker/t/FIRST_MAKEFILE.t ....................... FAILED at test 3
>      ../t/cpan/JSON-PP/t/003_types.t......... ....................................... FAILED--expected 76 tests, saw 18
>      ../t/cpan/JSON-PP/t/099_binary.t........ ...................................... FAILED--expected 2432 tests, saw 0
>      ../t/cpan/HTTP-Tiny/t/104_post.t........ ...................................... FAILED at test 1
>      ../t/cpan/IO-Compress/t/104destroy-bzip2.t ............................ FAILED--expected 15 tests, saw 4
>      ../t/cpan/ExtUtils-MakeMaker/t/VERSION_FROM.t ......................... FAILED--expected 1 tests, saw 0
>      ../t/cpan/MIME-Base64/t/quoted-print.t.. ................................ FAILED at test 2
>      ../t/cpan/HTTP-Tiny/t/100_get.t......... ....................................... FAILED at test 3
>      ../t/cpan/Pod-Simple/t/pulltitl.t....... ..................................... FAILED--expected 117 tests, saw 69
>      ../t/cpan/MIME-Base64/t/base64.t........ ...................................... FAILED at test 261
>      ../t/cpan/Test-Harness/t/harness.t...... .................................... FAILED at test 103
>      ../t/cpan/Digest-SHA/t/sha1.t........... ......................................... FAILED at test 1
>      ../t/cpan/Pod-Simple/t/fcodes.t......... ....................................... FAILED at test 17
>      ../t/cpan/podlators/t/color.t........... ......................................... FAILED at test 3
>      ../t/cpan/Pod-Simple/t/xhtml01.t........ ...................................... FAILED at test 39
>      ../t/cpan/libnet/t/nntp_ipv6.t.......... ........................................ FAILED--no leader found
>      ../t/cpan/Pod-Simple/t/x_nixer.t........ ...................................... FAILED at test 8
>      ../t/cpan/CPAN-Meta/t/validator.t....... ..................................... FAILED--no leader found
>      ../t/cpan/ExtUtils-MakeMaker/t/several_authors.t ...................... FAILED at test 4
>      ../t/cpan/CPAN-Meta-YAML/t/32_world_tml.t ............................. FAILED--no leader found
>      ../t/cpan/JSON-PP/t/116_incr_parse_fixed.t ............................ FAILED--expected 4 tests, saw 1
>      ../t/cpan/libnet/t/pop3_ssl.t........... ......................................... FAILED--no leader found
>      ../t/cpan/JSON-PP/t/109_encode.t........ ...................................... FAILED at test 2
>      ../t/cpan/HTTP-Tiny/t/050_chunked_body.t .............................. FAILED--non-zero wait status: 65280
>      ../t/cpan/HTTP-Tiny/t/020_headers.t..... ................................... FAILED at test 1
>      ../t/cpan/HTTP-Tiny/t/162_proxy_auth.t.. ................................ FAILED at test 1
>      ../t/cpan/ExtUtils-MakeMaker/t/metafile_data.t ........................ FAILED at test 14
>      ../t/cpan/CPAN-Meta/t/save-load.t....... ..................................... FAILED--no leader found
>      ../t/cpan/Digest-SHA/t/ireland.t........ ...................................... FAILED at test 1
>      ../t/cpan/JSON-PP/t/012_blessed.t....... ..................................... FAILED--expected 16 tests, saw 8
>      ../t/cpan/Parse-CPAN-Meta/t/03_functions.t ............................ FAILED--expected 2 tests, saw 0
>      ../t/cpan/libnet/t/smtp_ssl.t........... ......................................... FAILED--no leader found
>      ../t/cpan/Pod-Usage/t/pod/pod2usage2.t.. ................................ FAILED at test 3
>      ../t/cpan/Unicode-Normalize/t/func.t.... .................................. FAILED at test 10
>      ../t/cpan/File-Temp/t/security.t........ ...................................... FAILED at test 9
>      ../lib/h2ph.t........................... ....................................................... FAILED at test 1
>      ../t/cpan/CPAN-Meta/t/repository.t...... .................................... FAILED--no leader found
>      ../t/cpan/Archive-Tar/t/05_iter.t....... ..................................... FAILED at test 4
>      ../t/cpan/CPAN-Meta/t/meta-obj.t........ ...................................... FAILED--no leader found
>      ../t/cpan/CPAN-Meta-YAML/t/11_read_string.t ........................... FAILED--no leader found
>      ../t/cpan/HTTP-Tiny/t/030_response.t.... .................................. FAILED--no leader found
>      ../t/cpan/Digest-SHA/t/sha224.t......... ....................................... FAILED at test 1
>      ../t/cpan/CPAN-Meta-YAML/t/30_yaml_spec_tml.t ......................... FAILED at test 1
>      ../t/cpan/ExtUtils-MakeMaker/t/meta_convert.t ......................... FAILED at test 2
>      ../t/cpan/CPAN-Meta-YAML/t/21_yamlpm_compat.t ......................... FAILED--no leader found
>      ../t/cpan/CPAN-Meta/t/optional_feature-merge.t ........................ FAILED--no leader found
>      ../t/cpan/Digest-SHA/t/rfc2202.t........ ...................................... FAILED at test 1
>      ../t/cpan/Digest-SHA/t/sha256.t......... ....................................... FAILED at test 1
>      ../t/cpan/ExtUtils-MakeMaker/t/INST_PREFIX.t .......................... FAILED--expected 52 tests, saw 4
>      ../t/cpan/ExtUtils-MakeMaker/t/xs.t..... ................................... FAILED--no leader found
>      ../t/op/stat.t.......................... ...................................................... FAILED at test 2
>      ../t/cpan/Digest-SHA/t/fips180-4.t...... .................................... FAILED at test 1
>      ../t/cpan/CPAN-Meta/t/no-index.t........ ...................................... FAILED--no leader found
>      ../t/cpan/JSON-PP/t/014_latin1.t........ ...................................... FAILED at test 1
>      ../t/cpan/Pod-Simple/t/fcodes_s.t....... ..................................... FAILED at test 13
>      ../t/cpan/File-Temp/t/tempfile.t........ ...................................... FAILED at test 19
>      ../t/cpan/JSON-PP/t/019_incr.t.......... ........................................ FAILED--expected 697 tests, saw 0
>      ../t/cpan/Pod-Simple/t/fornot.t......... ....................................... FAILED at test 16
>      ../t/cpan/CPAN-Meta/t/converter-fail.t.. ................................ FAILED--no leader found
>      ../t/cpan/Socket/t/getnameinfo.t........ ...................................... FAILED at test 6
>      ../t/cpan/Digest-SHA/t/fips198.t........ ...................................... FAILED at test 1
>      ../t/cpan/HTTP-Tiny/t/160_cookies.t..... ................................... FAILED at test 1
>      ../t/cpan/podlators/t/man.t............. ........................................... FAILED at test 3
>      ../t/cpan/CPAN-Meta-YAML/t/31_local_tml.t ............................. FAILED--no leader found
>      ../t/cpan/CPAN-Meta/t/converter-fragments.t ........................... FAILED--no leader found
>      ../t/cpan/Archive-Tar/t/02_methods.t.... .................................. FAILED at test 20
>      ../t/cpan/IO-Compress/t/101truncate-bzip2.t ........................... FAILED--expected 4012 tests, saw 0
>      ../t/cpan/Pod-Simple/t/corpus.t......... ....................................... FAILED at test 2
>      ../t/cpan/ExtUtils-MakeMaker/t/pm.t..... ................................... FAILED--expected 6 tests, saw 5
>      ../t/porting/readme.t................... ............................................... FAILED at test 70
>      ../t/cpan/Pod-Simple/t/for.t............ .......................................... FAILED at test 8
>      ../t/dist/Data-Dumper/t/dumper.t........ ...................................... FAILED--expected 438 tests, saw 0
>      ../t/cpan/Unicode-Normalize/t/fcdc.t.... .................................. FAILED at test 20
>      ../t/cpan/JSON-PP/t/007_pc_esc.t........ ...................................... FAILED at test 1
>      ../ext/POSIX/t/sigaction.t.............. .......................................... FAILED--expected 33 tests, saw 30
>      ../t/cpan/ExtUtils-MakeMaker/t/prereq.t. ............................... FAILED--expected 16 tests, saw 5
>      ../t/cpan/MIME-Base64/t/unicode.t....... ..................................... FAILED at test 5
>      ../t/cpan/JSON-PP/t/002_error.t......... ....................................... FAILED at test 23
>      ../t/cpan/JSON-PP/t/zero-mojibake.t..... ................................... FAILED at test 1
>      ../t/cpan/CPAN-Meta/t/load-bad.t........ ...................................... FAILED at test 1
>      ../t/cpan/Test-Harness/t/yamlish-writer.t ............................. FAILED at test 16
>      ../t/cpan/ExtUtils-MakeMaker/t/PL_FILES.t ............................. FAILED at test 2
>      ../t/cpan/ExtUtils-MakeMaker/t/basic.t.. ................................ FAILED at test 3
>      ../t/cpan/JSON-PP/t/008_pc_base.t....... ..................................... FAILED--expected 20 tests, saw 2
>      ../t/cpan/Encode/t/grow.t............... ............................................. FAILED at test 2
>      ../t/cpan/IO-Compress/t/106prime-bzip2.t .............................. FAILED--no leader found
>      ../lib/open.t........................... ....................................................... FAILED at test 24
>      ../t/cpan/Pod-Simple/t/search20.t....... ..................................... FAILED at test 3
>      ../t/cpan/CPAN-Meta-YAML/t/10_read.t.... .................................. FAILED at test 1
>      ../t/cpan/Module-Metadata/t/encoding.t.. ................................ FAILED at test 1
>      ../t/cpan/Pod-Simple/t/search26.t....... ..................................... FAILED at test 3
>      ../t/cpan/ExtUtils-MakeMaker/t/min_perl_version.t ..................... FAILED at test 4
>      ../t/cpan/Pod-Simple/t/ac_d.t........... ......................................... FAILED at test 9
>      ../t/cpan/libnet/t/smtp_ipv6.t.......... ........................................ FAILED--no leader found
>      ../t/cpan/Digest-SHA/t/woodbury.t....... ..................................... FAILED at test 1
>      ../t/cpan/IO-Compress/t/110encode-bzip2.t ............................. FAILED at test 2
>      ../t/cpan/Unicode-Normalize/t/test.t.... .................................. FAILED at test 8
>      ../t/cpan/Encode/t/cow.t................ .............................................. FAILED at test 1
>      ../t/cpan/ExtUtils-MakeMaker/t/vstrings.t ............................. FAILED at test 2
>      ../t/cpan/Devel-PPPort/t/pv_tools.t..... ................................... FAILED at test 7
>      ../t/cpan/Digest-SHA/t/hmacsha.t........ ...................................... FAILED at test 1
>      ../t/cpan/IO-Compress/t/108anyunc-bzip2.t ............................. FAILED at test 5
>      ../t/cpan/Test-Harness/t/yamlish-output.t ............................. FAILED at test 3
>      ../t/cpan/ExtUtils-MakeMaker/t/INSTALL_BASE.t ......................... FAILED at test 3
>      ../t/cpan/Encode/t/jis7-fallback.t...... .................................... FAILED--no leader found
>      ../t/cpan/ExtUtils-MakeMaker/t/miniperl.t ............................. FAILED at test 3
>      ../t/cpan/IPC-Cmd/t/01_IPC-Cmd.t........ ...................................... FAILED at test 460
>      ../t/cpan/JSON-PP/t/107_allow_singlequote.t ........................... FAILED--expected 4 tests, saw 1
>      ../t/cpan/Pod-Simple/t/search10.t....... ..................................... FAILED at test 3
>      ../t/cpan/CPAN-Meta/t/converter-bad.t... ................................. FAILED--no leader found
>      ../t/cpan/JSON-PP/t/009_pc_extra_number.t ............................. FAILED--expected 6 tests, saw 0
>      ../t/dist/ExtUtils-CBuilder/t/04-base.t. ............................... FAILED at test 44
>      ../t/cpan/JSON-PP/t/106_allow_barekey.t. ............................... FAILED--expected 2 tests, saw 1
>      ../t/cpan/HTTP-Tiny/t/103_delete.t...... .................................... FAILED at test 1
>      ../t/cpan/Pod-Simple/t/search28.t....... ..................................... FAILED at test 3
>      ../t/cpan/Pod-Simple/t/output.t......... ....................................... FAILED at test 32
>      ../t/cpan/JSON-PP/t/018_json_checker.t.. ................................ FAILED at test 34
>      ../t/cpan/JSON-PP/t/001_utf8.t.......... ........................................ FAILED at test 1
>      ../t/cpan/libnet/t/pop3_ipv6.t.......... ........................................ FAILED--no leader found
>      ../t/cpan/IO-Compress/t/101truncate-rawdeflate.t ...................... FAILED--expected 625 tests, saw 635
>      ../t/cpan/JSON-PP/t/112_upgrade.t....... ..................................... FAILED at test 1
>      ../t/cpan/libnet/t/nntp_ssl.t........... ......................................... FAILED--no leader found
>      ../t/cpan/podlators/t/man-empty.t....... ..................................... FAILED at test 3
>      ../t/cpan/Pod-Simple/t/render.t......... ....................................... FAILED--expected test 23, saw test 25
>      ../t/cpan/libnet/t/smtp.t............... ............................................. FAILED--no leader found
>      ../t/cpan/Unicode-Normalize/t/null.t.... .................................. FAILED at test 3
>      ../t/cpan/CPAN-Meta/t/merge.t........... ......................................... FAILED--no leader found
>      ../t/cpan/HTTP-Tiny/t/130_redirect.t.... .................................. FAILED at test 1
>      ../t/cpan/HTTP-Tiny/t/161_basic_auth.t.. ................................ FAILED at test 1
>      ../t/cpan/HTTP-Tiny/t/170_keepalive.t... ................................. FAILED at test 1
>      ../t/cpan/ExtUtils-MakeMaker/t/recurs.t. ............................... FAILED at test 3
>      ../t/cpan/IO-Compress/t/102tied-bzip2.t. ............................... FAILED at test 18
>
> [perlio] -DDEBUGGING
> Inconsistent test results (between TEST and harness):
>      ../t/cpan/File-Temp/t/tempfile.t........ ...................................... FAILED at test 19
>      ../t/cpan/Pod-Simple/t/fcodes_s.t....... ..................................... FAILED at test 13
>      ../t/cpan/CPAN-Meta/t/no-index.t........ ...................................... FAILED--no leader found
>      ../t/cpan/JSON-PP/t/014_latin1.t........ ...................................... FAILED at test 1
>      ../t/cpan/Digest-SHA/t/fips180-4.t...... .................................... FAILED at test 1
>      ../t/cpan/JSON-PP/t/019_incr.t.......... ........................................ FAILED--expected 697 tests, saw 0
>      ../t/cpan/Pod-Simple/t/fornot.t......... ....................................... FAILED at test 16
>      ../t/cpan/Digest-SHA/t/fips198.t........ ...................................... FAILED at test 1
>      ../t/cpan/Socket/t/getnameinfo.t........ ...................................... FAILED at test 6
>      ../t/cpan/CPAN-Meta/t/converter-fail.t.. ................................ FAILED--no leader found
>      ../t/cpan/podlators/t/man.t............. ........................................... FAILED at test 3
>      ../t/cpan/HTTP-Tiny/t/160_cookies.t..... ................................... FAILED at test 1
>      ../t/cpan/CPAN-Meta-YAML/t/31_local_tml.t ............................. FAILED--no leader found
>      ../t/cpan/IO-Compress/t/101truncate-bzip2.t ........................... FAILED--expected 4012 tests, saw 0
>      ../t/cpan/CPAN-Meta/t/converter-fragments.t ........................... FAILED--no leader found
>      ../t/cpan/Archive-Tar/t/02_methods.t.... .................................. FAILED at test 20
>      ../t/cpan/Pod-Simple/t/corpus.t......... ....................................... FAILED at test 2
>      ../t/porting/readme.t................... ............................................... FAILED at test 70
>      ../t/cpan/ExtUtils-MakeMaker/t/pm.t..... ................................... FAILED--expected 6 tests, saw 5
>      ../t/dist/Data-Dumper/t/dumper.t........ ...................................... FAILED--expected 438 tests, saw 0
>      ../t/cpan/Pod-Simple/t/for.t............ .......................................... FAILED at test 8
>      ../t/cpan/Unicode-Normalize/t/fcdc.t.... .................................. FAILED at test 20
>      ../t/cpan/JSON-PP/t/007_pc_esc.t........ ...................................... FAILED at test 1
>      ../ext/POSIX/t/sigaction.t.............. .......................................... FAILED--expected 33 tests, saw 30
>      ../t/cpan/MIME-Base64/t/unicode.t....... ..................................... FAILED at test 5
>      ../t/cpan/ExtUtils-MakeMaker/t/prereq.t. ............................... FAILED--expected 16 tests, saw 5
>      ../t/cpan/JSON-PP/t/002_error.t......... ....................................... FAILED at test 23
>      ../t/cpan/Test-Harness/t/yamlish-writer.t ............................. FAILED at test 16
>      ../t/cpan/CPAN-Meta/t/load-bad.t........ ...................................... FAILED at test 1
>      ../t/cpan/JSON-PP/t/zero-mojibake.t..... ................................... FAILED at test 1
>      ../t/cpan/ExtUtils-MakeMaker/t/PL_FILES.t ............................. FAILED at test 2
>      ../t/cpan/JSON-PP/t/008_pc_base.t....... ..................................... FAILED--expected 20 tests, saw 2
>      ../t/cpan/ExtUtils-MakeMaker/t/basic.t.. ................................ FAILED at test 3
>      ../t/cpan/Encode/t/grow.t............... ............................................. FAILED at test 2
>      ../t/cpan/IO-Compress/t/106prime-bzip2.t .............................. FAILED--no leader found
>      ../lib/open.t........................... ....................................................... FAILED at test 24
>      ../t/cpan/Pod-Simple/t/search20.t....... ..................................... FAILED at test 3
>      ../t/cpan/CPAN-Meta-YAML/t/10_read.t.... .................................. FAILED at test 1
>      ../t/cpan/Module-Metadata/t/encoding.t.. ................................ FAILED at test 1
>      ../t/cpan/Pod-Simple/t/ac_d.t........... ......................................... FAILED at test 9
>      ../t/cpan/ExtUtils-MakeMaker/t/min_perl_version.t ..................... FAILED at test 4
>      ../t/cpan/Pod-Simple/t/search26.t....... ..................................... FAILED at test 3
>      ../t/cpan/Digest-SHA/t/woodbury.t....... ..................................... FAILED at test 1
>      ../t/cpan/IO-Compress/t/110encode-bzip2.t ............................. FAILED at test 2
>      ../t/cpan/libnet/t/smtp_ipv6.t.......... ........................................ FAILED--no leader found
>      ../t/cpan/Encode/t/cow.t................ .............................................. FAILED at test 1
>      ../t/cpan/Unicode-Normalize/t/test.t.... .................................. FAILED at test 8
>      ../t/cpan/ExtUtils-MakeMaker/t/vstrings.t ............................. FAILED at test 2
>      ../t/cpan/Devel-PPPort/t/pv_tools.t..... ................................... FAILED at test 7
>      ../t/cpan/Digest-SHA/t/hmacsha.t........ ...................................... FAILED at test 1
>      ../t/cpan/IO-Compress/t/108anyunc-bzip2.t ............................. FAILED at test 5
>      ../t/cpan/Test-Harness/t/yamlish-output.t ............................. FAILED at test 3
>      ../t/cpan/ExtUtils-MakeMaker/t/INSTALL_BASE.t ......................... FAILED at test 3
>      ../t/cpan/ExtUtils-MakeMaker/t/miniperl.t ............................. FAILED at test 3
>      ../t/cpan/Encode/t/jis7-fallback.t...... .................................... FAILED--no leader found
>      ../t/cpan/JSON-PP/t/107_allow_singlequote.t ........................... FAILED--expected 4 tests, saw 1
>      ../t/cpan/IPC-Cmd/t/01_IPC-Cmd.t........ ...................................... FAILED at test 460
>      ../t/cpan/Pod-Simple/t/search10.t....... ..................................... FAILED at test 3
>      ../t/cpan/CPAN-Meta/t/converter-bad.t... ................................. FAILED--no leader found
>      ../t/cpan/JSON-PP/t/009_pc_extra_number.t ............................. FAILED--expected 6 tests, saw 0
>      ../t/dist/ExtUtils-CBuilder/t/04-base.t. ............................... FAILED at test 44
>      ../t/cpan/JSON-PP/t/106_allow_barekey.t. ............................... FAILED--expected 2 tests, saw 1
>      ../t/cpan/HTTP-Tiny/t/103_delete.t...... .................................... FAILED at test 1
>      ../t/cpan/Pod-Simple/t/output.t......... ....................................... FAILED at test 32
>      ../t/cpan/Pod-Simple/t/search28.t....... ..................................... FAILED at test 3
>      ../t/cpan/JSON-PP/t/018_json_checker.t.. ................................ FAILED at test 34
>      ../t/cpan/libnet/t/pop3_ipv6.t.......... ........................................ FAILED--no leader found
>      ../t/cpan/IO-Compress/t/101truncate-rawdeflate.t ...................... FAILED--expected 625 tests, saw 635
>      ../t/cpan/JSON-PP/t/001_utf8.t.......... ........................................ FAILED at test 1
>      ../t/cpan/JSON-PP/t/112_upgrade.t....... ..................................... FAILED at test 1
>      ../t/cpan/libnet/t/nntp_ssl.t........... ......................................... FAILED--no leader found
>      ../t/cpan/Unicode-Normalize/t/null.t.... .................................. FAILED at test 3
>      ../t/cpan/libnet/t/smtp.t............... ............................................. FAILED--no leader found
>      ../t/cpan/podlators/t/man-empty.t....... ..................................... FAILED at test 3
>      ../t/cpan/Pod-Simple/t/render.t......... ....................................... FAILED--expected test 23, saw test 25
>      ../t/cpan/HTTP-Tiny/t/130_redirect.t.... .................................. FAILED at test 1
>      ../t/cpan/CPAN-Meta/t/merge.t........... ......................................... FAILED--no leader found
>      ../t/cpan/HTTP-Tiny/t/161_basic_auth.t.. ................................ FAILED at test 1
>      ../t/cpan/HTTP-Tiny/t/170_keepalive.t... ................................. FAILED at test 1
>      ../t/cpan/ExtUtils-MakeMaker/t/recurs.t. ............................... FAILED at test 3
>      ../t/cpan/IO-Compress/t/102tied-bzip2.t. ............................... FAILED at test 18
>      ../t/cpan/Pod-Simple/t/fcodes_l.t....... ..................................... FAILED at test 6
>      ../t/cpan/ExtUtils-Manifest/t/Manifest.t .............................. FAILED at test 43
>      ../t/cpan/ExtUtils-MakeMaker/t/INST.t... ................................. FAILED--expected 26 tests, saw 4
>      ../t/cpan/HTTP-Tiny/t/150_post_form.t... ................................. FAILED at test 1
>      ../t/cpan/Unicode-Normalize/t/norm.t.... .................................. FAILED at test 8
>      ../t/cpan/Archive-Tar/t/04_resolved_issues.t .......................... FAILED at test 38
>      ../t/cpan/Pod-Simple/t/htmlbat.t........ ...................................... FAILED--expected 17 tests, saw 2
>      ../t/cpan/podlators/t/text.t............ .......................................... FAILED at test 5
>      ../t/cpan/Encode/t/decode.t............. ........................................... FAILED at test 1
>      ../t/cpan/CPAN-Meta-YAML/t/12_write.t... ................................. FAILED--no leader found
>      ../t/cpan/Digest-SHA/t/sha512.t......... ....................................... FAILED at test 1
>      ../t/cpan/ExtUtils-MakeMaker/t/WriteEmptyMakefile.t ................... FAILED--expected 5 tests, saw 4
>      ../t/cpan/ExtUtils-MakeMaker/t/postamble.t ............................ FAILED--expected 8 tests, saw 4
>      ../t/cpan/File-Temp/t/object.t.......... ........................................ FAILED at test 8
>      ../t/cpan/Text-Balanced/t/06_extqlk.t... ................................. FAILED at test 50
>      ../t/cpan/podlators/t/text-empty.t...... .................................... FAILED at test 3
>      ../t/cpan/ExtUtils-MakeMaker/t/unicode.t .............................. FAILED--expected 9 tests, saw 4
>      ../t/cpan/Pod-Simple/t/begin.t.......... ........................................ FAILED at test 26
>      ../t/cpan/HTTP-Tiny/t/110_mirror.t...... .................................... FAILED at test 1
>      ../t/cpan/Pod-Simple/t/search12.t....... ..................................... FAILED at test 3
>      ../t/cpan/ExtUtils-MakeMaker/t/pm_to_blib.t ........................... FAILED at test 3
>      ../t/cpan/podlators/t/basic.t........... ......................................... FAILED at test 6
>      ../t/cpan/Digest-SHA/t/unicode.t........ ...................................... FAILED at test 1
>      ../t/cpan/Unicode-Collate/t/normal.t.... .................................. FAILED at test 11
>      ../t/cpan/Pod-Simple/t/reinit.t......... ....................................... FAILED--expected 5 tests, saw 4
>      ../t/cpan/PerlIO-via-QuotedPrint/t/QuotedPrint.t ...................... FAILED--seen duplicate leader
>      ../t/cpan/IO-Compress/t/001bzip2.t...... .................................... FAILED at test 58
>      ../t/cpan/Pod-Simple/t/encod04.t........ ...................................... FAILED at test 2
>      ../t/cpan/ExtUtils-MakeMaker/t/build_man.t ............................ FAILED--expected 9 tests, saw 5
>      ../t/dist/Net-Ping/t/450_service.t...... .................................... FAILED at test 9
>      ../t/cpan/podlators/t/termcap.t......... ....................................... FAILED at test 3
>      ../t/cpan/ExtUtils-MakeMaker/t/writemakefile_args.t ................... FAILED at test 4
>      ../t/run/locale.t....................... ................................................... FAILED at test 30
>      ../t/cpan/IO-Compress/t/103newtied-bzip2.t ............................ FAILED at test 15
>      ../t/cpan/Test-Harness/t/yamlish.t...... .................................... FAILED at test 44
>      ../t/cpan/Digest-SHA/t/methods.t........ ...................................... FAILED at test 2
>      ../t/cpan/JSON-PP/t/021_evans_bugrep.t.. ................................ FAILED--expected 6 tests, saw 2
>      ../t/cpan/Encode/t/gsm0338.t............ .......................................... FAILED at test 11
>      ../t/cpan/Digest-SHA/t/base64.t......... ....................................... FAILED at test 1
>      ../t/cpan/IO-Compress/t/100generic-bzip2.t ............................ FAILED at test 36
>      ../t/cpan/CPAN-Meta/t/converter.t....... ..................................... FAILED--no leader found
>      ../t/cpan/podlators/t/text-encoding.t... ................................. FAILED at test 3
>      ../t/cpan/HTTP-Tiny/t/102_put.t......... ....................................... FAILED at test 1
>      ../t/cpan/JSON-PP/t/017_relaxed.t....... ..................................... FAILED--expected 8 tests, saw 4
>      ../t/cpan/IO-Compress/t/105oneshot-bzip2.t ............................ FAILED--expected 1002 tests, saw 117
>      ../t/op/pack.t.......................... ...................................................... FAILED at test 4174
>      ../t/cpan/Digest-SHA/t/sha384.t......... ....................................... FAILED at test 1
>      ../t/cpan/Unicode-Collate/t/nonchar.t... ................................. FAILED at test 52
>      ../t/cpan/JSON-PP/t/114_decode_prefix.t. ............................... FAILED--expected 8 tests, saw 0
>      ../t/cpan/JSON-PP/t/108_decode.t........ ...................................... FAILED--expected 6 tests, saw 0
>      ../t/cpan/Parse-CPAN-Meta/t/02_api.t.... .................................. FAILED--no leader found
>      ../t/cpan/JSON-PP/t/022_comment_at_eof.t .............................. FAILED at test 13
>      ../t/cpan/IO-Compress/t/107multi-bzip2.t .............................. FAILED at test 8
>      ../t/cpan/JSON-PP/t/099_binary.t........ ...................................... FAILED--expected 2432 tests, saw 0
>      ../t/cpan/JSON-PP/t/003_types.t......... ....................................... FAILED--expected 76 tests, saw 18
>      ../t/cpan/ExtUtils-MakeMaker/t/FIRST_MAKEFILE.t ....................... FAILED at test 3
>      ../t/cpan/Digest-SHA/t/state.t.......... ........................................ FAILED at test 1
>      ../t/cpan/Pod-Simple/t/search22.t....... ..................................... FAILED at test 3
>      ../t/cpan/HTTP-Tiny/t/101_head.t........ ...................................... FAILED at test 1
>      ../t/cpan/IPC-Cmd/t/03_run-forked.t..... ................................... FAILED at test 3
>      ../t/cpan/ExtUtils-MakeMaker/t/VERSION_FROM.t ......................... FAILED--expected 1 tests, saw 0
>      ../t/cpan/IO-Compress/t/104destroy-bzip2.t ............................ FAILED--expected 15 tests, saw 4
>      ../t/cpan/HTTP-Tiny/t/104_post.t........ ...................................... FAILED at test 1
>      ../t/cpan/MIME-Base64/t/quoted-print.t.. ................................ FAILED at test 2
>      ../t/cpan/HTTP-Tiny/t/100_get.t......... ....................................... FAILED at test 3
>      ../t/cpan/Pod-Simple/t/pulltitl.t....... ..................................... FAILED--expected 117 tests, saw 69
>      ../t/cpan/Test-Harness/t/harness.t...... .................................... FAILED at test 103
>      ../t/cpan/MIME-Base64/t/base64.t........ ...................................... FAILED at test 261
>      ../t/cpan/podlators/t/color.t........... ......................................... FAILED at test 3
>      ../t/cpan/Digest-SHA/t/sha1.t........... ......................................... FAILED at test 1
>      ../t/cpan/Pod-Simple/t/fcodes.t......... ....................................... FAILED at test 17
>      ../t/cpan/Pod-Simple/t/xhtml01.t........ ...................................... FAILED at test 39
>      ../t/cpan/libnet/t/nntp_ipv6.t.......... ........................................ FAILED--no leader found
>      ../t/cpan/ExtUtils-MakeMaker/t/several_authors.t ...................... FAILED at test 4
>      ../t/cpan/CPAN-Meta/t/validator.t....... ..................................... FAILED--no leader found
>      ../t/cpan/Pod-Simple/t/x_nixer.t........ ...................................... FAILED at test 8
>      ../t/cpan/JSON-PP/t/109_encode.t........ ...................................... FAILED at test 2
>      ../t/cpan/libnet/t/pop3_ssl.t........... ......................................... FAILED--no leader found
>      ../t/cpan/JSON-PP/t/116_incr_parse_fixed.t ............................ FAILED--expected 4 tests, saw 1
>      ../t/cpan/CPAN-Meta-YAML/t/32_world_tml.t ............................. FAILED--no leader found
>      ../t/cpan/HTTP-Tiny/t/050_chunked_body.t .............................. FAILED--non-zero wait status: 65280
>      ../t/cpan/HTTP-Tiny/t/020_headers.t..... ................................... FAILED at test 1
>      ../t/cpan/HTTP-Tiny/t/162_proxy_auth.t.. ................................ FAILED at test 1
>      ../t/cpan/JSON-PP/t/012_blessed.t....... ..................................... FAILED--expected 16 tests, saw 8
>      ../t/cpan/Digest-SHA/t/ireland.t........ ...................................... FAILED at test 1
>      ../t/cpan/CPAN-Meta/t/save-load.t....... ..................................... FAILED--no leader found
>      ../t/cpan/ExtUtils-MakeMaker/t/metafile_data.t ........................ FAILED at test 14
>      ../t/cpan/Pod-Usage/t/pod/pod2usage2.t.. ................................ FAILED at test 3
>      ../t/cpan/Unicode-Normalize/t/func.t.... .................................. FAILED at test 10
>      ../t/cpan/libnet/t/smtp_ssl.t........... ......................................... FAILED--no leader found
>      ../t/cpan/Parse-CPAN-Meta/t/03_functions.t ............................ FAILED--expected 2 tests, saw 0
>      ../lib/h2ph.t........................... ....................................................... FAILED at test 1
>      ../t/cpan/CPAN-Meta/t/repository.t...... .................................... FAILED--no leader found
>      ../t/cpan/File-Temp/t/security.t........ ...................................... FAILED at test 9
>      ../t/cpan/Archive-Tar/t/05_iter.t....... ..................................... FAILED at test 4
>      ../t/cpan/HTTP-Tiny/t/030_response.t.... .................................. FAILED--no leader found
>      ../t/cpan/CPAN-Meta-YAML/t/11_read_string.t ........................... FAILED--no leader found
>      ../t/cpan/CPAN-Meta/t/meta-obj.t........ ...................................... FAILED--no leader found
>      ../t/cpan/Digest-SHA/t/sha224.t......... ....................................... FAILED at test 1
>      ../t/cpan/ExtUtils-MakeMaker/t/meta_convert.t ......................... FAILED at test 2
>      ../t/cpan/CPAN-Meta-YAML/t/30_yaml_spec_tml.t ......................... FAILED at test 1
>      ../t/cpan/CPAN-Meta-YAML/t/21_yamlpm_compat.t ......................... FAILED--no leader found
>      ../t/cpan/Digest-SHA/t/rfc2202.t........ ...................................... FAILED at test 1
>      ../t/cpan/CPAN-Meta/t/optional_feature-merge.t ........................ FAILED--no leader found
>      ../t/op/stat.t.......................... ...................................................... FAILED at test 2
>      ../t/cpan/ExtUtils-MakeMaker/t/xs.t..... ................................... FAILED--no leader found
>      ../t/cpan/ExtUtils-MakeMaker/t/INST_PREFIX.t .......................... FAILED--expected 52 tests, saw 4
>      ../t/cpan/Digest-SHA/t/sha256.t......... ....................................... FAILED at test 1
>
> Compiler messages(os390):
>
>
>
> --
> Report by Test::Smoke v1.6 running on perl 5.21.7
> (Reporter v0.052 / Smoker v0.045)
>
>
> ------------------------------------------------------------------------
>   Yaroslav Kuzmin
> Developer C/C++ ,z/OS , Linux
> 3 Zhukovskiy Street · Miass, Chelyabinsk region 456318 · Russia
> Tel:  +7.922.2.38.33.38
> Email: YKuzmin@rocketsoftware.com
> Web: www.rocketsoftware.com
> ================================
> Rocket Software, Inc. and subsidiaries ■ 77 Fourth Avenue, Waltham MA 02451 ■ +1 800.966.3270 ■ +1 781.577.4321
> Unsubscribe From Commercial Email – unsubscribe@rocketsoftware.com
> Manage Your Subscription Preferences - http://info.rocketsoftware.com/GlobalSubscriptionManagementEmailFooter_SubscriptionCenter.html
> Privacy Policy - http://www.rocketsoftware.com/company/legal/privacy-policy
> ================================
>
> This communication and any attachments may contain confidential information of Rocket Software, Inc. All unauthorized use, disclosure or distribution is prohibited. If you are not the intended recipient, please notify Rocket Software immediately and destroy all copies of this communication. Thank you.
>


Thread Previous


nntp.perl.org: Perl Programming lists via nntp and http.
Comments to Ask Bjørn Hansen at ask@perl.org | Group listing | About