develooper Front page | perl.perl5.porters | Postings from November 2014

Smoke [khw/ebcdic] v5.21.7-26bc3dee z/OS

From:
Yaroslav Kuzmin
Date:
November 27, 2014 12:11
Subject:
Smoke [khw/ebcdic] v5.21.7-26bc3dee z/OS
Message ID:
06ebc22c57654de688dd6bb066ebbe56@wal-s-mbx2.rocketsoftware.com
Smoke logs available at -  https://drive.google.com/file/d/0B5PTttxwo7qAUnhnZHE5aUFFa2M

Automated smoke report for branch ????? 5.21.7 patch
RS12: 2817 (2817/)
    on        os/390 - 23.00
    using     c99 version
    smoketime 1 hour 17 minutes (average 38 minutes 56 seconds)

Summary: FAIL(Xc)

O = OK  F = Failure(s), extended report at the bottom
X = Failure(s) under TEST but not under harness
? = still running or test results not (yet) available
Build failures during:       - = unknown or N/A
c = Configure, m = make, M = make (after miniperl), t = make test-prep

             Configuration (common) none
----------- ---------------------------------------------------------
X X c -
| | | +----- PERLIO = perlio -DDEBUGGING
| | +------- PERLIO = stdio  -DDEBUGGING
| +--------- PERLIO = perlio
+----------- PERLIO = stdio


Tests skipped on user request:
    # One test name on a line
Failures: (common-args) none
[stdio]
Inconsistent test results (between TEST and harness):
    ../t/dist/Carp/t/arg_string.t........... ........................................ FAILED at test 8
    ../t/lib/croak.t........................ ................................................... FAILED at test 9
    ../t/run/locale.t....................... .................................................. FAILED at test 30
    ../ext/Pod-Html/t/htmlescp.t............ ....................................... FAILED at test 1
    ../ext/POSIX/t/math.t................... .............................................. FAILED at test 81
    ../t/dist/Carp/t/Carp.t................. .............................................. FAILED at test 27
    ../t/op/stat.t.......................... ..................................................... FAILED at test 93
    ../lib/B/Deparse.t...................... ................................................. FAILED--expected 30 tests, saw 2
    ../t/porting/readme.t................... .............................................. FAILED at test 69
    ../t/porting/diag.t..................... ................................................ FAILED at test 1597
    ../t/op/bop.t........................... ...................................................... FAILED--expected 439 tests, saw 47
    ../t/re/reg_eval_scope.t................ ........................................... FAILED--expected 48 tests, saw 29
    ../t/dist/Module-CoreList/t/corelist.t.. ............................... FAILED at test 8
    ../t/op/sprintf.t....................... .................................................. FAILED at test 544
    ../t/uni/chomp.t........................ ................................................... FAILED at test 3
    ../t/dist/ExtUtils-CBuilder/t/04-base.t. .............................. FAILED at test 44
    ../t/op/infnan.t........................ ................................................... FAILED at test 298
    ../t/dist/Module-CoreList/t/utils.t..... .................................. FAILED at test 6
    ../lib/open.t........................... ...................................................... FAILED at test 24
    ../t/lib/1_compile.t.................... ............................................... FAILED at test 1
    ../t/dist/Data-Dumper/t/dumper.t........ ..................................... FAILED at test 2
    ../ext/Devel-Peek/t/Peek.t.............. ......................................... FAILED at test 94
    ../t/dist/Data-Dumper/t/bugs.t.......... ....................................... FAILED at test 9
    ../lib/h2ph.t........................... ...................................................... FAILED at test 3
    ../t/comp/final_line_num.t.............. ......................................... FAILED--expected 1 tests, saw 0
    ../ext/Pod-Html/t/htmlview.t............ ....................................... FAILED at test 1
    ../t/re/pat_rt_report.t................. ............................................ FAILED--expected 2532 tests, saw 2501
    ../t/op/pack.t.......................... ..................................................... FAILED at test 14036
    ../lib/DBM_Filter/t/encode.t............ ....................................... FAILED at test 25
    ../t/dist/Net-Ping/t/450_service.t...... ................................... FAILED at test 9
    ../ext/POSIX/t/sigaction.t.............. ......................................... FAILED--expected 33 tests, saw 30
    ../ext/PerlIO-encoding/t/encoding.t..... ................................ FAILED at test 4
    ../t/dist/Carp/t/arg_regexp.t........... ........................................ FAILED at test 1

[perlio]
Inconsistent test results (between TEST and harness):
    ../ext/Pod-Html/t/htmlescp.t............ ....................................... FAILED at test 1
    ../t/run/locale.t....................... .................................................. FAILED at test 30
    ../t/dist/Carp/t/arg_string.t........... ........................................ FAILED at test 8
    ../t/lib/croak.t........................ ................................................... FAILED at test 9
    ../t/re/reg_eval_scope.t................ ........................................... FAILED--expected 48 tests, saw 29
    ../t/op/bop.t........................... ...................................................... FAILED--expected 439 tests, saw 47
    ../t/dist/Module-CoreList/t/corelist.t.. ............................... FAILED at test 8
    ../t/porting/readme.t................... .............................................. FAILED at test 69
    ../t/porting/diag.t..................... ................................................ FAILED at test 1597
    ../t/op/stat.t.......................... ..................................................... FAILED at test 93
    ../lib/B/Deparse.t...................... ................................................. FAILED--expected 30 tests, saw 2
    ../ext/POSIX/t/math.t................... .............................................. FAILED at test 81
    ../t/dist/Carp/t/Carp.t................. .............................................. FAILED at test 27
    ../t/dist/Data-Dumper/t/dumper.t........ ..................................... FAILED at test 2
    ../ext/Devel-Peek/t/Peek.t.............. ......................................... FAILED at test 94
    ../lib/open.t........................... ...................................................... FAILED at test 24
    ../t/lib/1_compile.t.................... ............................................... FAILED at test 1
    ../t/dist/ExtUtils-CBuilder/t/04-base.t. .............................. FAILED at test 44
    ../t/op/infnan.t........................ ................................................... FAILED at test 298
    ../t/dist/Module-CoreList/t/utils.t..... .................................. FAILED at test 6
    ../t/op/sprintf.t....................... .................................................. FAILED at test 544
    ../t/uni/chomp.t........................ ................................................... FAILED at test 3
    ../t/dist/Net-Ping/t/450_service.t...... ................................... FAILED at test 9
    ../ext/PerlIO-encoding/t/encoding.t..... ................................ FAILED at test 4
    ../ext/POSIX/t/sigaction.t.............. ......................................... FAILED--expected 33 tests, saw 30
    ../t/dist/Carp/t/arg_regexp.t........... ........................................ FAILED at test 1
    ../t/re/pat_rt_report.t................. ............................................ FAILED--expected 2532 tests, saw 2501
    ../t/op/pack.t.......................... ..................................................... FAILED at test 14036
    ../lib/DBM_Filter/t/encode.t............ ....................................... FAILED at test 25
    ../t/comp/final_line_num.t.............. ......................................... FAILED--expected 1 tests, saw 0
    ../ext/Pod-Html/t/htmlview.t............ ....................................... FAILED at test 1
    ../t/dist/Data-Dumper/t/bugs.t.......... ....................................... FAILED at test 9
    ../lib/h2ph.t........................... ...................................................... FAILED at test 3

Compiler messages(os390):



--
Report by Test::Smoke v1.6 running on perl 5.21.6
(Reporter v0.052 / Smoker v0.045)

P.S.  in file utf8.c in  function Perl__to_utf8_fold_flags  line 2186 and line 2193 identical variable name
const unsigned int long_s_t_len


------------------------------------------------------------------------
 Yaroslav Kuzmin
Developer C/C++ ,z/OS , Linux
3 Zhukovskiy Street * Miass, Chelyabinsk region 456318 * Russia
Tel:  +7.922.2.38.33.38
Email: YKuzmin@rocketsoftware.com
Web: www.rocketsoftware.com

================================
Rocket Software, Inc. and subsidiaries ? 77 Fourth Avenue, Waltham MA 02451 ? +1 800.966.3270 ? +1 781.577.4321
Unsubscribe From Commercial Email - unsubscribe@rocketsoftware.com
Manage Your Subscription Preferences - http://info.rocketsoftware.com/GlobalSubscriptionManagementEmailFooter_SubscriptionCenter.html
Privacy Policy - http://www.rocketsoftware.com/company/legal/privacy-policy
================================

This communication and any attachments may contain confidential information of Rocket Software, Inc. All unauthorized use, disclosure or distribution is prohibited. If you are not the intended recipient, please notify Rocket Software immediately and destroy all copies of this communication. Thank you.



nntp.perl.org: Perl Programming lists via nntp and http.
Comments to Ask Bjørn Hansen at ask@perl.org | Group listing | About