develooper Front page | perl.perl5.porters | Postings from November 2014

Smoke [blead] v5.21.5-481-gc62df97 FAIL(F) MSWin32 Win2000 SP4 (x86/1 cpu) {blead}

From:
George Greer
Date:
November 15, 2014 23:04
Subject:
Smoke [blead] v5.21.5-481-gc62df97 FAIL(F) MSWin32 Win2000 SP4 (x86/1 cpu) {blead}
Message ID:
20141115230408.AD6664E0307@zwei
Smoke logs available at http://m-l.org/~perl/smoke/perl/win32/blead/logc62df97fd6a0ef53562060054f04dfeadb67f5f8.log.gz

Known failures on Win32:

../t/win32/popen.t..........................................FAILED
    Non-zero exit status: 9
    No plan found in TAP output

../cpan/Time-HiRes/t/usleep.t...............................FAILED
    3
    Non-zero exit status: 1

../t/op/threads.t...........................................FAILED
    Non-zero exit status: 9
    Bad plan.  You planned 27 tests but ran 9.

../cpan/IPC-Cmd/t/01_IPC-Cmd.t..............................FAILED
    27-28
    42
    115-116
    Non-zero exit status: 2

Automated smoke report for 5.21.6 patch c62df97fd6a0ef53562060054f04dfeadb67f5f8 v5.21.5-481-gc62df97
perl-win2k: Intel(R) Core(TM) i7 CPU 920 @ 2.67GHz(~2664 MHz) (x86/1 cpu)
    on        MSWin32 - Win2000 SP4
    using     cl version 14.00.50727.762
    smoketime 4 hours 52 minutes (average 1 hour 13 minutes)

Summary: FAIL(F)

O = OK  F = Failure(s), extended report at the bottom
X = Failure(s) under TEST but not under harness
? = still running or test results not (yet) available
Build failures during:       - = unknown or N/A
c = Configure, m = make, M = make (after miniperl), t = make test-prep

v5.21.5-481-gc62df97  Configuration (common) none
----------- ---------------------------------------------------------
O F         
O O         -Duseithreads
| +--------- -DDEBUGGING
+----------- no debugging


Locally applied patches:
    SMOKEc62df97fd6a0ef53562060054f04dfeadb67f5f8

Failures: (common-args) none
[default] -DDEBUGGING
../cpan/IPC-Cmd/t/01_IPC-Cmd.t..............................FAILED
    152
    Non-zero exit status: 1

Passed Todo tests: (common-args) none
[default] 
[default] -DDEBUGGING
[default] -Duseithreads
[default] -DDEBUGGING -Duseithreads
../cpan/ExtUtils-MakeMaker/t/pm_to_blib.t...................PASSED
    10-11
../ext/IPC-Open3/t/IPC-Open3.t..............................PASSED
    25

Compiler messages(MSWin32):
op.c(8352) : warning C4244: 'function' : conversion from 'cv_flags_t' to 'char', possible loss of data
RealPPPort.xs(1864) : warning C4101: 'len' : unreferenced local variable
Base64.xs(394) : warning C4146: unary minus operator applied to unsigned type, result still unsigned
Base64.xs(396) : warning C4146: unary minus operator applied to unsigned type, result still unsigned
POSIX.xs(791) : warning C4244: '=' : conversion from 'double' to 'int', possible loss of data
-- 
Report by Test::Smoke v1.53 build 1374 running on perl 5.10.0
(Reporter v0.050 / Smoker v0.045)




nntp.perl.org: Perl Programming lists via nntp and http.
Comments to Ask Bjørn Hansen at ask@perl.org | Group listing | About