develooper Front page | perl.perl5.porters | Postings from November 2014

Smoke [blead] v5.21.5-480-gcf34c81 FAIL(m) linux 3.13.0-36-generic [debian] (x86_64/8 cpu) {blead_g++_quick}

From:
George Greer
Date:
November 15, 2014 18:31
Subject:
Smoke [blead] v5.21.5-480-gcf34c81 FAIL(m) linux 3.13.0-36-generic [debian] (x86_64/8 cpu) {blead_g++_quick}
Message ID:
201411151831.sAFIVHDF020032@m-l.org
Smoke logs available at http://m-l.org/~perl/smoke/perl/linux/blead_g++_quick/logcf34c81f6b96c70e2ecf357bbaf3b28eb58272c4.log.gz

Automated smoke report for 5.21.6 patch cf34c81f6b96c70e2ecf357bbaf3b28eb58272c4 v5.21.5-480-gcf34c81
zwei: Intel(R) Core(TM) i7 CPU 920 @ 2.67GHz (GenuineIntel 2668MHz) (x86_64/8 cpu)
    on        linux - 3.13.0-36-generic [debian]
    using     g++ version 4.8.2
    smoketime 1 hour 5 minutes (average 16 minutes 18 seconds)

Summary: FAIL(m)

O = OK  F = Failure(s), extended report at the bottom
X = Failure(s) under TEST but not under harness
? = still running or test results not (yet) available
Build failures during:       - = unknown or N/A
c = Configure, m = make, M = make (after miniperl), t = make test-prep

v5.21.5-480-gcf34c81  Configuration (common) -Accflags=-DPERL_POISON -Dcc=g++
----------- ---------------------------------------------------------
O O         
O m         -Duseithreads
| +--------- -DDEBUGGING
+----------- no debugging


Locally applied patches:
    SMOKEcf34c81f6b96c70e2ecf357bbaf3b28eb58272c4

Testsuite was run only with 'harness'

Passed Todo tests: (common-args) -Accflags=-DPERL_POISON -Dcc=g++
[default] 
[default] -DDEBUGGING
[default] -Duseithreads
../cpan/ExtUtils-MakeMaker/t/pm_to_blib.t...................PASSED
    10-11

Compiler messages(gcc):
util.c: In function ‘I32 Perl_xs_handshake(U32, void*, const char*, ...)’:
util.c:5385:39: warning: cast to pointer from integer of different size [-Wint-to-pointer-cast]
MD5.xs: In function ‘void XS_Digest__MD5_md5(CV*)’:
../../handy.h:456:36: warning: null argument where non-null required (argument 1) [-Wnonnull]
DB_File.xs: In function ‘int db_put(DB_File, DBTKEY, DBT, u_int)’:
DB_File.xs:311:77: warning: comparison between signed and unsigned integer expressions [-Wsign-compare]
../../pp.h: In function ‘void XS_DB_File_constant(CV*)’:
../../pp.h:306:54: warning: ‘iv’ may be used uninitialized in this function [-Wmaybe-uninitialized]
../../pp.h: In function ‘void XS_Compress__Raw__Zlib_constant(CV*)’:
../../pp.h: In function ‘void XS_IPC__SysV__constant(CV*)’:
Encode.xs: In function ‘U8* process_utf8(SV*, U8*, U8*, SV*, bool, bool, bool)’:
Encode.xs:366:26: warning: comparison between signed and unsigned integer expressions [-Wsign-compare]
Encode.xs:370:34: warning: comparison between signed and unsigned integer expressions [-Wsign-compare]
ListUtil.xs: In function ‘void XS_List__Util_min(CV*)’:
ListUtil.xs:129:39: warning: ‘retval’ may be used uninitialized in this function [-Wmaybe-uninitialized]
<command-line>:0:14: warning: missing whitespace after the macro name [enabled by default]
Piece.xs: In function ‘char* _strptime(const char*, const char*, tm*, int*)’:
Piece.xs:362:49: warning: comparison between signed and unsigned integer expressions [-Wsign-compare]
Piece.xs: In function ‘void XS_Time__Piece__strftime(CV*)’:
Piece.xs:1059:44: warning: comparison between signed and unsigned integer expressions [-Wsign-compare]
Piece.xs:811:8: warning: ‘len’ may be used uninitialized in this function [-Wmaybe-uninitialized]
POSIX.o: In function `XS_POSIX_tmpnam(cv*)':
APItest.xs:262:32: warning: missing initializer for member ‘mgvtbl::svt_set’ [-Wmissing-field-initializers]
APItest.xs:262:32: warning: missing initializer for member ‘mgvtbl::svt_len’ [-Wmissing-field-initializers]
APItest.xs:262:32: warning: missing initializer for member ‘mgvtbl::svt_clear’ [-Wmissing-field-initializers]
APItest.xs:262:32: warning: missing initializer for member ‘mgvtbl::svt_free’ [-Wmissing-field-initializers]
APItest.xs:262:32: warning: missing initializer for member ‘mgvtbl::svt_copy’ [-Wmissing-field-initializers]
APItest.xs:262:32: warning: missing initializer for member ‘mgvtbl::svt_dup’ [-Wmissing-field-initializers]
APItest.xs:262:32: warning: missing initializer for member ‘mgvtbl::svt_local’ [-Wmissing-field-initializers]
APItest.c: In function ‘void XS_XS__APItest__PtrTable_clear(CV*)’:
../../embed.h:464:28: warning: ‘void Perl_ptr_table_clear(PTR_TBL_t*)’ is deprecated (declared at ../../proto.h:3421) [-Wdeprecated-declarations]
../../embed.h:464:56: warning: ‘void Perl_ptr_table_clear(PTR_TBL_t*)’ is deprecated (declared at ../../proto.h:3421) [-Wdeprecated-declarations]
../../pp.h: In function ‘void XS_Time__HiRes_constant(CV*)’:
../../../../pp.h: In function ‘void XS_ExtTest_constant(CV*)’:
../../../../pp.h:304:58: warning: ‘pv’ may be used uninitialized in this function [-Wmaybe-uninitialized]
../../../../embed.h:659:52: warning: ‘iv’ may be used uninitialized in this function [-Wmaybe-uninitialized]
../../../../pp.h:306:54: warning: ‘iv’ may be used uninitialized in this function [-Wmaybe-uninitialized]
op.c: In function ‘CV* Perl_newATTRSUB_x(I32, OP*, OP*, OP*, OP*, bool)’:
op.c:8566:21: warning: ‘start’ may be used uninitialized in this function [-Wmaybe-uninitialized]
op.c: In function ‘CV* Perl_newMYSUB(I32, OP*, OP*, OP*, OP*)’:
op.c:8101:21: warning: ‘start’ may be used uninitialized in this function [-Wmaybe-uninitialized]
POSIX.o: In function `XS_POSIX_tmpnam':
/home/perl/smoke/perl/blead_g++_quick/build/ext/POSIX/POSIX.xs:3015: warning: the use of `tmpnam' is dangerous, better use `mkstemp'
vutil.c:36:1: warning: unused parameter ‘my_perl’ [-Wunused-parameter]
regcomp.c:3716:1: warning: unused parameter ‘my_perl’ [-Wunused-parameter]
perlio.c:5066:1: warning: unused parameter ‘my_perl’ [-Wunused-parameter]
perlio.c:5081:1: warning: unused parameter ‘my_perl’ [-Wunused-parameter]
MD5.xs: In function ‘void XS_Digest__MD5_md5(PerlInterpreter*, CV*)’:
../../pp.h: In function ‘void XS_DB_File_constant(PerlInterpreter*, CV*)’:
ListUtil.xs: In function ‘void XS_List__Util_min(PerlInterpreter*, CV*)’:
Encode.xs: In function ‘U8* process_utf8(PerlInterpreter*, SV*, U8*, U8*, SV*, bool, bool, bool)’:
../../pp.h: In function ‘void XS_IPC__SysV__constant(PerlInterpreter*, CV*)’:
../../pp.h: In function ‘void XS_Compress__Raw__Zlib_constant(PerlInterpreter*, CV*)’:
POSIX.o: In function `XS_POSIX_tmpnam(interpreter*, cv*)':
Piece.xs: In function ‘char* _strptime(PerlInterpreter*, const char*, const char*, tm*, int*)’:
Piece.xs: In function ‘void XS_Time__Piece__strftime(PerlInterpreter*, CV*)’:
APItest.c: In function ‘void XS_XS__APItest__PtrTable_clear(PerlInterpreter*, CV*)’:
../../embed.h:464:28: warning: ‘void Perl_ptr_table_clear(PerlInterpreter*, PTR_TBL_t*)’ is deprecated (declared at ../../proto.h:3421) [-Wdeprecated-declarations]
../../embed.h:464:56: warning: ‘void Perl_ptr_table_clear(PerlInterpreter*, PTR_TBL_t*)’ is deprecated (declared at ../../proto.h:3421) [-Wdeprecated-declarations]
../../pp.h: In function ‘void XS_Time__HiRes_constant(PerlInterpreter*, CV*)’:
../../../../pp.h: In function ‘void XS_ExtTest_constant(PerlInterpreter*, CV*)’:
util.c: In function ‘void* Perl_safesysmalloc(size_t)’:
util.c:175:2: error: jump to label ‘ret’ [-fpermissive]
util.c:184:11: error:   from here [-fpermissive]
util.c:149:41: error:   skips initialization of ‘perl_memory_debug_header* const header’
pad.c:200:1: warning: unused parameter ‘my_perl’ [-Wunused-parameter]
-- 
Report by Test::Smoke v1.53 build 1374 running on perl 5.18.2
(Reporter v0.050 / Smoker v0.045)




nntp.perl.org: Perl Programming lists via nntp and http.
Comments to Ask Bjørn Hansen at ask@perl.org | Group listing | About