develooper Front page | perl.perl5.porters | Postings from October 2014

Smoke [blead] v5.21.5-115-gabdcbdb FAIL(F) MSWin32 Win2000 SP4 (x86/1 cpu) {blead}

From:
George Greer
Date:
October 27, 2014 05:08
Subject:
Smoke [blead] v5.21.5-115-gabdcbdb FAIL(F) MSWin32 Win2000 SP4 (x86/1 cpu) {blead}
Message ID:
20141027050832.A36304E010B@zwei

Automated smoke report for 5.21.6 patch abdcbdb837d9244b83dc32ee471b3b7f383a6c18 v5.21.5-115-gabdcbdb
perl-win2k: Intel(R) Core(TM) i7 CPU 920 @ 2.67GHz(~2657 MHz) (x86/1 cpu)
    on        MSWin32 - Win2000 SP4
    using     cl version 14.00.50727.762
    smoketime 7 hours 22 minutes (average 1 hour 50 minutes)

Summary: FAIL(F)

O = OK  F = Failure(s), extended report at the bottom
X = Failure(s) under TEST but not under harness
? = still running or test results not (yet) available
Build failures during:       - = unknown or N/A
c = Configure, m = make, M = make (after miniperl), t = make test-prep

v5.21.5-115-gabdcbdb  Configuration (common) none
----------- ---------------------------------------------------------
F F         
F F         -Duseithreads
| +--------- -DDEBUGGING
+----------- no debugging


Locally applied patches:
    SMOKEabdcbdb837d9244b83dc32ee471b3b7f383a6c18

Failures: (common-args) none
[default] 
[default] -DDEBUGGING
[default] -DDEBUGGING -Duseithreads
../dist/PathTools/t/cwd.t...................................FAILED
    Non-zero exit status: 255
    Bad plan.  You planned 31 tests but ran 30.

[default] -Duseithreads
../cpan/ExtUtils-MakeMaker/t/xs.t...........................FAILED
    4
    Non-zero exit status: 1
../dist/PathTools/t/cwd.t...................................FAILED
    Non-zero exit status: 255
    Bad plan.  You planned 31 tests but ran 30.

Passed Todo tests: (common-args) none
[default] 
[default] -DDEBUGGING
[default] -Duseithreads
[default] -DDEBUGGING -Duseithreads
../ext/IPC-Open3/t/IPC-Open3.t..............................PASSED
    25

Compiler messages(MSWin32):
RealPPPort.xs(1864) : warning C4101: 'len' : unreferenced local variable
Base64.xs(394) : warning C4146: unary minus operator applied to unsigned type, result still unsigned
Base64.xs(396) : warning C4146: unary minus operator applied to unsigned type, result still unsigned
# Test.c(205) : fatal error C1090: PDB API call failed, error code '23' : '(
# NMAKE : fatal error U1077: '"C:\Program Files\Microsoft Visual Studio 8\VC\BIN\cl.EXE"' : return code '0x2'
-- 
Report by Test::Smoke v1.53 build 1374 running on perl 5.10.0
(Reporter v0.050 / Smoker v0.045)




nntp.perl.org: Perl Programming lists via nntp and http.
Comments to Ask Bjørn Hansen at ask@perl.org | Group listing | About