develooper Front page | perl.perl5.porters | Postings from October 2014

Smoke [5.21.6] v5.21.5-115-gabdcbdb FAIL(Xc) netbsd 6.1.5 (i386/2 cpu)

From:
njh
Date:
October 26, 2014 20:55
Subject:
Smoke [5.21.6] v5.21.5-115-gabdcbdb FAIL(Xc) netbsd 6.1.5 (i386/2 cpu)
Message ID:
201410262054.s9QKsq47031021@compaq.bandsman.co.uk
Automated smoke report for 5.21.6 patch abdcbdb837d9244b83dc32ee471b3b7f383a6c18 v5.21.5-115-gabdcbdb
philips.bandsman.co.uk: Intel 686-class (i386/2 cpu)
    on        netbsd - 6.1.5
    using     cc version 4.5.3
    smoketime 42 minutes 18 seconds (average 21 minutes 9 seconds)

Summary: FAIL(Xc)

O = OK  F = Failure(s), extended report at the bottom
X = Failure(s) under TEST but not under harness
? = still running or test results not (yet) available
Build failures during:       - = unknown or N/A
c = Configure, m = make, M = make (after miniperl), t = make test-prep

v5.21.5-115-gabdcbdb  Configuration (common) -Accflags="-O2 -W -Wformat=2 -Wall -Wextra -pipe -fomit-frame-pointer -D_FORTIFY_SOURCE=2 -fstack-protector -Wstack-protector -Wfloat-equal"
----------- ---------------------------------------------------------
X -         -Duseithreads
c -         -Duselongdouble
| +--------- -DDEBUGGING
+----------- no debugging


Locally applied patches:
    SMOKEabdcbdb837d9244b83dc32ee471b3b7f383a6c18

Failures: (common-args) -Accflags="-O2 -W -Wformat=2 -Wall -Wextra -pipe -fomit-frame-pointer -D_FORTIFY_SOURCE=2 -fstack-protector -Wstack-protector -Wfloat-equal"
[default] -Duseithreads
Inconsistent test results (between TEST and harness):
    ../ext/POSIX/t/usage.t.................. .............................................. FAILED--no leader found
    ../t/porting/extrefs.t.................. .............................................. FAILED--no leader found
    ../t/cpan/IO-Compress/t/002any-zip.t.... .................................. FAILED--no leader found
    ../t/cpan/Test-Harness/t/testargs.t..... ................................... FAILED--expected 21 tests, saw 16
    ../ext/re/t/re_funcs_u.t................ ............................................ FAILED--no leader found
    ../t/dist/Tie-File/t/26_twrite.t........ ...................................... FAILED--no leader found
    ../t/cpan/IO-Compress/t/107multi-bzip2.t .............................. FAILED--expected 1828 tests, saw 14
    ../t/dist/Tie-File/t/33_defer_vs.t...... .................................... FAILED--no leader found
    ../t/dist/Net-Ping/t/510_ping_udp.t..... ................................... FAILED at test 1
    ../t/dist/Net-Ping/t/110_icmp_inst.t.... .................................. FAILED at test 1
    ../ext/POSIX/t/wrappers.t............... ........................................... FAILED--no leader found
    ../t/cpan/version/t/00impl-pp.t......... ....................................... FAILED at test 1
    ../t/dist/Tie-File/t/07_rv_splice.t..... ................................... FAILED--no leader found
    ../t/cpan/IO-Socket-IP/t/05local-server-v6.t .......................... FAILED--no leader found
    ../t/dist/Tie-File/t/19_cache.t......... ....................................... FAILED--no leader found
    ../t/dist/I18N-Collate/t/I18N-Collate.t. ............................... FAILED at test 1
    ../t/dist/Tie-File/t/10_splice_rs.t..... ................................... FAILED--no leader found
    ../t/dist/Tie-File/t/13_size_rs.t....... ..................................... FAILED--no leader found
    ../t/cpan/IO-Compress/t/105oneshot-gzip.t ............................. FAILED--expected 1002 tests, saw 99
    ../t/cpan/IO-Socket-IP/t/00use.t........ ...................................... FAILED at test 1
    ../t/cpan/Test-Harness/t/harness-subclass.t ........................... FAILED at test 2
    ../t/dist/Net-Ping/t/140_stream_inst.t.. ................................ FAILED at test 1
    ../t/cpan/IO-Compress/t/107multi-zip.t.. ................................ FAILED--no leader found
    ../t/cpan/version/t/07locale.t.......... ........................................ FAILED--no leader found
    ../t/cpan/IO-Socket-IP/t/30nonblocking-connect.t ...................... FAILED--no leader found
    ../t/cpan/Test-Harness/t/harness-bailout.t ............................ FAILED--expected 4 tests, saw 0
    ../t/cpan/IO-Compress/t/106prime-bzip2.t .............................. FAILED--no leader found
    ../t/dist/Tie-File/t/02_fetchsize.t..... ................................... FAILED--no leader found
    ../t/cpan/IO-Compress/t/105oneshot-zip-bzip2-only.t ................... FAILED at test 2
    ../t/dist/Tie-File/t/20_cache_full.t.... .................................. FAILED--no leader found
    ../t/cpan/IO-Socket-IP/t/14fileno.t..... ................................... FAILED--no leader found
    ../t/dist/ExtUtils-CBuilder/t/04-base.t. ............................... FAILED--expected 64 tests, saw 0
    ../t/cpan/IO-Socket-IP/t/02local-server-v4.t .......................... FAILED--no leader found
    ../t/re/charset.t....................... ................................................... FAILED--non-zero wait status: 65280
    ../t/cpan/IO-Socket-IP/t/20subclass.t... ................................. FAILED--no leader found
    ../t/cpan/Test-Harness/t/compat/failure.t ............................. FAILED at test 1
    ../t/cpan/File-Fetch/t/01_File-Fetch.t.. ................................ FAILED at test 1
    ../t/dist/Tie-File/t/01_gen.t........... ......................................... FAILED--no leader found
    ../t/dist/ExtUtils-CBuilder/t/03-cplusplus.t .......................... FAILED--no leader found
    ../t/dist/Tie-File/t/08_ro.t............ .......................................... FAILED--no leader found
    ../t/cpan/IO-Socket-IP/t/01local-client-v4.t .......................... FAILED--no leader found
    ../t/cpan/IO-Compress/t/002any-transparent.t .......................... FAILED at test 1
    ../t/cpan/IO-Socket-IP/t/17gai-flags.t.. ................................ FAILED--no leader found
    ../t/cpan/Sys-Syslog/t/00-load.t........ ...................................... FAILED at test 1
    ../t/cpan/IO-Compress/t/105oneshot-bzip2.t ............................ FAILED--expected 1002 tests, saw 99
    ../t/dist/Tie-File/t/16_handle.t........ ...................................... FAILED--no leader found
    ../t/cpan/IO-Compress/t/108anyunc-transparent.t ....................... FAILED--expected 15 tests, saw 2
    ../t/cpan/Sys-Syslog/t/facilities-routing.t ........................... FAILED--no leader found
    ../t/dist/Tie-File/t/25_gen_nocache.t... ................................. FAILED--no leader found
    ../t/dist/Tie-File/t/05_size.t.......... ........................................ FAILED--no leader found
    ../t/cpan/File-Fetch/t/null_subclass.t.. ................................ FAILED at test 1
    ../t/cpan/Pod-Perldoc/t/load.t.......... ........................................ FAILED at test 12
    ../ext/POSIX/t/sigset.t................. ............................................. FAILED--no leader found
    ../t/op/sigdispatch.t................... ............................................... FAILED--expected 29 tests, saw 4
    ../t/cpan/IO-Compress/t/102tied-zip.t... ................................. FAILED--no leader found
    ../t/dist/Tie-File/t/42_offset.t........ ...................................... FAILED--no leader found
    ../t/cpan/Test-Harness/t/compat/env.t... ................................. FAILED--expected 1 tests, saw 0
    ../t/cpan/Test-Harness/t/compat/test-harness-compat.t ................. FAILED--expected 120 tests, saw 0
    ../t/cpan/IPC-Cmd/t/03_run-forked.t..... ................................... FAILED at test 1
    ../ext/POSIX/t/export.t................. ............................................. FAILED--no leader found
    ../t/cpan/IO-Compress/t/101truncate-bzip2.t ........................... FAILED--expected 4012 tests, saw 0
    ../t/dist/Net-Ping/t/100_load.t......... ....................................... FAILED at test 1
    ../ext/XS-APItest/t/handy.t............. ......................................... FAILED--no leader found
    ../t/dist/Tie-File/t/23_rv_ac_splice.t.. ................................ FAILED--no leader found
    ../ext/POSIX/t/posix.t.................. .............................................. FAILED--expected 120 tests, saw 0
    ../t/dist/Tie-File/t/11_rv_splice_rs.t.. ................................ FAILED--no leader found
    ../t/dist/ExtUtils-ParseXS/t/002-more.t. ............................... FAILED--no leader found
    ../ext/POSIX/t/is.t..................... ................................................. FAILED--no leader found
    ../t/dist/Net-Ping/t/520_icmp_ttl.t..... ................................... FAILED at test 1
    ../t/dist/Tie-File/t/21_win32.t......... ....................................... FAILED--no leader found
    ../t/cpan/IO-Socket-IP/t/18fdopen.t..... ................................... FAILED--no leader found
    ../t/dist/Safe/t/safe3.t................ .............................................. FAILED--no leader found
    ../t/cpan/IO-Compress/t/106prime-zip.t.. ................................ FAILED--no leader found
    ../t/dist/ExtUtils-ParseXS/t/001-basic.t .............................. FAILED--expected 17 tests, saw 0
    ../t/cpan/IO-Socket-IP/t/03local-cross-v4.t ........................... FAILED--no leader found
    ../t/dist/ExtUtils-CBuilder/t/01-basic.t .............................. FAILED--no leader found
    ../t/dist/Net-Ping/t/450_service.t...... .................................... FAILED at test 1
    ../t/dist/Tie-File/t/29a_upcopy.t....... ..................................... FAILED--no leader found
    ../t/cpan/IO-Compress/t/000prereq.t..... ................................... FAILED at test 21
    ../t/cpan/Test-Harness/t/compat/subclass.t ............................ FAILED--expected 1 tests, saw 0
    ../t/dist/Tie-File/t/15_pushpop.t....... ..................................... FAILED--no leader found
    ../t/cpan/Sys-Syslog/t/syslog.t......... ....................................... FAILED at test 1
    ../t/dist/Tie-File/t/31_autodefer.t..... ................................... FAILED--no leader found
    ../t/cpan/CPAN/t/03pkgs.t............... ............................................. FAILED at test 5
    ../t/dist/Tie-File/t/06_fixrec.t........ ...................................... FAILED--no leader found
    ../t/cpan/Test-Harness/t/file.t......... ....................................... FAILED--expected 56 tests, saw 2
    ../t/dist/Tie-File/t/24_cache_loop.t.... .................................. FAILED--no leader found
    ../t/cpan/Test-Harness/t/compat/inc_taint.t ........................... FAILED--expected 1 tests, saw 0
    ../t/dist/Tie-File/t/30_defer.t......... ....................................... FAILED--no leader found
    ../t/cpan/IO-Socket-IP/t/19no-addrs.t... ................................. FAILED--no leader found
    ../t/cpan/IO-Socket-IP/t/10args.t....... ..................................... FAILED--no leader found
    ../t/dist/Tie-File/t/17_misc_meth.t..... ................................... FAILED--no leader found
    ../t/dist/Tie-File/t/12_longfetch_rs.t.. ................................ FAILED--no leader found
    ../t/cpan/IO-Compress/t/100generic-zip.t .............................. FAILED--no leader found
    ../t/dist/ExtUtils-ParseXS/t/003-usage.t .............................. FAILED--no leader found
    ../t/cpan/IO-Compress/t/105oneshot-deflate.t .......................... FAILED--expected 1002 tests, saw 99
    ../t/cpan/Test-Harness/t/nofork.t....... ..................................... FAILED--non-zero wait status: 512
    ../t/dist/Net-Ping/t/120_udp_inst.t..... ................................... FAILED at test 1
    ../t/cpan/IO-Compress/t/108anyunc-bzip2.t ............................. FAILED--expected 48 tests, saw 4
    ../t/cpan/IO-Compress/t/006zip.t........ ...................................... FAILED at test 2
    ../t/cpan/podlators/t/devise-date.t..... ................................... FAILED--expected 1 tests, saw 0
    ../ext/POSIX/t/time.t................... ............................................... FAILED--no leader found
    ../lib/locale.t......................... ..................................................... FAILED--no leader found
    ../t/cpan/podlators/t/basic.t........... ......................................... FAILED at test 4
    ../t/cpan/IO-Compress/t/001zlib-generic-zip.t ......................... FAILED--no leader found
    ../t/cpan/Test-Harness/t/console.t...... .................................... FAILED--no leader found
    ../t/cpan/Test-Harness/t/perl5lib.t..... ................................... FAILED--expected 1 tests, saw 0
    ../t/cpan/IO-Compress/t/110encode-zip.t. ............................... FAILED--no leader found
    ../t/cpan/IPC-Cmd/t/01_IPC-Cmd.t........ ...................................... FAILED at test 1
    ../t/cpan/Test-Harness/t/compat/inc-propagation.t ..................... FAILED--expected 2 tests, saw 0
    ../ext/IPC-Open3/t/IPC-Open3.t.......... ...................................... FAILED--expected 44 tests, saw 0
    ../t/cpan/IO-Socket-IP/t/21as-inet.t.... .................................. FAILED--no leader found
    ../t/cpan/ExtUtils-MakeMaker/t/basic.t.. ................................ FAILED at test 22
    ../t/dist/Tie-File/t/18_rs_fixrec.t..... ................................... FAILED--no leader found
    ../t/op/alarm.t......................... ..................................................... FAILED at test 4
    ../t/dist/Tie-File/t/00_version.t....... ..................................... FAILED--no leader found
    ../ext/POSIX/t/math.t................... ............................................... FAILED--no leader found
    ../t/cpan/CPAN/t/01loadme.t............. ........................................... FAILED--expected 1 tests, saw 0
    ../t/dist/Tie-File/t/28_mtwrite.t....... ..................................... FAILED--no leader found
    ../lib/ExtUtils/t/Embed.t............... ........................................... FAILED--no leader found
    ../t/cpan/IO-Compress/t/105oneshot-zip-store-only.t ................... FAILED at test 2
    ../t/cpan/IO-Socket-IP/t/31nonblocking-connect-internet.t ............. FAILED--no leader found
    ../t/dist/Tie-File/t/32_defer_misc.t.... .................................. FAILED--no leader found
    ../t/cpan/IO-Compress/t/108anyunc-zip.t. ............................... FAILED--no leader found
    ../t/dist/Tie-File/t/29_downcopy.t...... .................................... FAILED--no leader found
    ../t/cpan/Test-Harness/t/compat/env_opts.t ............................ FAILED--expected 12 tests, saw 0
    ../t/cpan/podlators/t/termcap.t......... ....................................... FAILED at test 1
    ../t/dist/Tie-File/t/41_heap.t.......... ........................................ FAILED--no leader found
    ../t/cpan/IO-Compress/t/105oneshot-zip.t .............................. FAILED--no leader found
    ../ext/POSIX/t/taint.t.................. .............................................. FAILED--expected 7 tests, saw 0
    ../ext/POSIX/t/termios.t................ ............................................ FAILED--no leader found
    ../lib/B/Deparse.t...................... .................................................. FAILED--no leader found
    ../t/cpan/CPAN/t/11mirroredby.t......... ....................................... FAILED at test 1
    ../t/dist/ExtUtils-CBuilder/t/00-have-compiler.t ...................... FAILED at test 1
    ../ext/POSIX/t/sysconf.t................ ............................................ FAILED--no leader found
    ../t/cpan/autodie/t/flock.t............. ........................................... FAILED--no leader found
    ../t/cpan/IO-Compress/t/002any-deflate.t .............................. FAILED--no leader found
    ../t/dist/Tie-File/t/09_gen_rs.t........ ...................................... FAILED--no leader found
    ../lib/Benchmark.t...................... .................................................. FAILED at test 127
    ../t/cpan/IO-Socket-IP/t/15io-socket.t.. ................................ FAILED--no leader found
    ../t/cpan/IO-Compress/t/105oneshot-zip-only.t ......................... FAILED at test 2
    ../t/cpan/IO-Socket-IP/t/22timeout.t.... .................................. FAILED--no leader found
    ../t/dist/Net-Ping/t/500_ping_icmp.t.... .................................. FAILED at test 1
    ../t/op/groups.t........................ .................................................... FAILED--no leader found
    ../t/cpan/IO-Socket-IP/t/16v6only.t..... ................................... FAILED--no leader found
    ../t/op/sigsystem.t..................... ................................................. FAILED--expected 4 tests, saw 0
    ../t/dist/ExtUtils-CBuilder/t/02-link.t. ............................... FAILED--no leader found
    ../t/cpan/IO-Compress/t/103newtied-zip.t .............................. FAILED--no leader found
    ../t/dist/Tie-File/t/03_longfetch.t..... ................................... FAILED--no leader found
    ../t/dist/Tie-File/t/04_splice.t........ ...................................... FAILED--no leader found
    ../t/cpan/IO-Compress/t/002any-rawdeflate.t ........................... FAILED--no leader found
    ../t/dist/Tie-File/t/40_abs_cache.t..... ................................... FAILED--no leader found
    ../t/cpan/IO-Socket-IP/t/06local-cross-v6.t ........................... FAILED--no leader found
    ../t/cpan/IO-Compress/t/002any-gzip.t... ................................. FAILED--no leader found
    ../t/cpan/IO-Compress/t/101truncate-zip.t ............................. FAILED--expected 9156 tests, saw 0
    ../t/re/fold_grind.t.................... ................................................ FAILED--no leader found
    ../t/dist/Tie-File/t/27_iwrite.t........ ...................................... FAILED--no leader found
    ../ext/B/t/concise-xs.t................. ............................................. FAILED at test 1197
    ../t/cpan/IO-Compress/t/104destroy-zip.t .............................. FAILED--no leader found
    ../t/cpan/IO-Socket-IP/t/12port-fallback.t ............................ FAILED--no leader found
    ../ext/POSIX/t/unimplemented.t.......... ...................................... FAILED--no leader found
    ../t/cpan/IO-Compress/t/104destroy-bzip2.t ............................ FAILED--expected 15 tests, saw 4
    ../t/cpan/Test-Harness/t/compat/switches.t ............................ FAILED--expected 4 tests, saw 0
    ../t/cpan/IO-Compress/t/105oneshot-rawdeflate.t ....................... FAILED--expected 1002 tests, saw 99
    ../t/cpan/Test-Harness/t/proverun.t..... ................................... FAILED--expected 6 tests, saw 0
    ../t/cpan/Sys-Syslog/t/constants.t...... .................................... FAILED at test 1
    ../t/cpan/IO-Socket-IP/t/13addrinfo.t... ................................. FAILED--no leader found
    ../t/dist/Tie-File/t/22_autochomp.t..... ................................... FAILED--no leader found
    ../t/dist/Tie-File/t/14_lock.t.......... ........................................ FAILED--no leader found
    ../t/cpan/Test-Harness/t/harness.t...... .................................... FAILED at test 4
    ../t/cpan/IO-Socket-IP/t/11sockopts.t... ................................. FAILED--no leader found
    ../t/cpan/IO-Socket-IP/t/04local-client-v6.t .......................... FAILED--no leader found
    ../t/dist/Net-Ping/t/130_tcp_inst.t..... ................................... FAILED at test 1
    ../t/dist/Net-Ping/t/150_syn_inst.t..... ................................... FAILED at test 1

Compiler messages(gcc):
Configure ...try.c: In function 'main':
try.c: In function 'main':
try.c: In function 'blech':
try.c: In function 'blech_in_list':
try.c: In function 'bletch':
ExtTest.c: In function 'XS_ExtTest_constant':
ExtTest.xs:418:6: warning: 'iv' may be used uninitialized in this function
ExtTest.xs:420:14: warning: 'pv' may be used uninitialized in this function
ExtTest.xs:194:14: warning: 'pv' may be used uninitialized in this function
ExtTest.xs:209:6: warning: 'iv' may be used uninitialized in this function
ExtTest.xs:190:6: warning: 'iv' may be used uninitialized in this function
ExtTest.xs:166:6: warning: 'iv' may be used uninitialized in this function

-- 
Report by Test::Smoke v1.53 build 1374 running on perl 5.20.0
(Reporter v0.050 / Smoker v0.045)



nntp.perl.org: Perl Programming lists via nntp and http.
Comments to Ask Bjørn Hansen at ask@perl.org | Group listing | About