develooper Front page | perl.perl5.porters | Postings from October 2014

Smoke [blead] v5.21.4-288-g9224f6d FAIL(F) linux 3.13.0-36-generic [debian] (x86_64/8 cpu) {blead_g++_quick}

From:
George Greer
Date:
October 8, 2014 22:39
Subject:
Smoke [blead] v5.21.4-288-g9224f6d FAIL(F) linux 3.13.0-36-generic [debian] (x86_64/8 cpu) {blead_g++_quick}
Message ID:
201410082239.s98MdjgI015895@m-l.org
Smoke logs available at http://m-l.org/~perl/smoke/perl/linux/blead_g++_quick/log9224f6d1ec92517f0305f2d8db2e5efc7a3cf7c7.log.gz

Automated smoke report for 5.21.5 patch 9224f6d1ec92517f0305f2d8db2e5efc7a3cf7c7 v5.21.4-288-g9224f6d
zwei: Intel(R) Core(TM) i7 CPU 920 @ 2.67GHz (GenuineIntel 2668MHz) (x86_64/8 cpu)
    on        linux - 3.13.0-36-generic [debian]
    using     g++ version 4.8.2
    smoketime 1 hour (average 15 minutes 8 seconds)

Summary: FAIL(F)

O = OK  F = Failure(s), extended report at the bottom
X = Failure(s) under TEST but not under harness
? = still running or test results not (yet) available
Build failures during:       - = unknown or N/A
c = Configure, m = make, M = make (after miniperl), t = make test-prep

v5.21.4-288-g9224f6d  Configuration (common) -Accflags=-DPERL_POISON -Dcc=g++
----------- ---------------------------------------------------------
F F         
F F         -Duseithreads
| +--------- -DDEBUGGING
+----------- no debugging


Locally applied patches:
    SMOKE9224f6d1ec92517f0305f2d8db2e5efc7a3cf7c7

Testsuite was run only with 'harness'

Failures: (common-args) -Accflags=-DPERL_POISON -Dcc=g++
[default] 
[default] -DDEBUGGING
../t/re/pat_advanced.t......................................FAILED
    Non-zero exit status: 2
    No plan found in TAP output
../lib/mypragma.t...........................................FAILED
    Non-zero exit status: 2
    Bad plan.  You planned 14 tests but ran 0.
../t/porting/pod_rules.t....................................FAILED
    Non-zero exit status: 2
    No plan found in TAP output

[default] -Duseithreads
[default] -DDEBUGGING -Duseithreads
../t/re/pat_advanced.t......................................FAILED
    Non-zero exit status: 2
    No plan found in TAP output
../t/re/pat_advanced_thr.t..................................FAILED
    Non-zero exit status: 2
    No plan found in TAP output
../lib/mypragma.t...........................................FAILED
    Non-zero exit status: 2
    Bad plan.  You planned 14 tests but ran 0.
../t/porting/pod_rules.t....................................FAILED
    Non-zero exit status: 2
    No plan found in TAP output

Compiler messages(gcc):
MD5.xs: In function ‘void XS_Digest__MD5_md5(CV*)’:
../../handy.h:455:36: warning: null argument where non-null required (argument 1) [-Wnonnull]
POSIX.o: In function `XS_POSIX_tmpnam(cv*)':
POSIX.o: In function `XS_POSIX_tmpnam':
/home/perl/smoke/perl/blead_g++_quick/build/ext/POSIX/POSIX.xs:2915: warning: the use of `tmpnam' is dangerous, better use `mkstemp'
vutil.c:36:1: warning: unused parameter ‘my_perl’ [-Wunused-parameter]
MD5.xs: In function ‘void XS_Digest__MD5_md5(PerlInterpreter*, CV*)’:
POSIX.o: In function `XS_POSIX_tmpnam(interpreter*, cv*)':
-- 
Report by Test::Smoke v1.53 build 1374 running on perl 5.18.2
(Reporter v0.050 / Smoker v0.045)




nntp.perl.org: Perl Programming lists via nntp and http.
Comments to Ask Bjørn Hansen at ask@perl.org | Group listing | About