develooper Front page | perl.perl5.porters | Postings from September 2014

Smoke [5.14.4] v5.14.4-2-g5875c53 FAIL(XF) linux 3.0.35-cm-fx6-6.1[debian] (armv7l/4 cpu)

From:
njh
Date:
September 10, 2014 22:27
Subject:
Smoke [5.14.4] v5.14.4-2-g5875c53 FAIL(XF) linux 3.0.35-cm-fx6-6.1[debian] (armv7l/4 cpu)
Message ID:
201409102227.s8AMRRoK026918@compaq.bandsman.co.uk
Automated smoke report for 5.14.4 patch 5875c53b4ef8c948011dc6f4e7e4ae4e6effd6aa v5.14.4-2-g5875c53
utilite:  ( 0MHz) (armv7l/4 cpu)
    on        linux - 3.0.35-cm-fx6-6.1 [debian]
    using     cc version 4.7.2
    smoketime 11 hours 51 minutes (average 1 hour 28 minutes)

Summary: FAIL(XF)

O = OK  F = Failure(s), extended report at the bottom
X = Failure(s) under TEST but not under harness
? = still running or test results not (yet) available
Build failures during:       - = unknown or N/A
c = Configure, m = make, M = make (after miniperl), t = make test-prep

v5.14.4-2-g5875c53  Configuration (common) none
----------- ---------------------------------------------------------
X X         -Uuseperlio
O O         
F F         -Duse64bitint
O -         -Duselongdouble
| +--------- -DDEBUGGING
+----------- no debugging


Locally applied patches:
    SMOKE5875c53b4ef8c948011dc6f4e7e4ae4e6effd6aa

Failures: (common-args) none
[default] -Uuseperlio
Inconsistent test results (between TEST and harness):
    ../t/cpan/Test-Simple/t/Builder/output.tFAILED--expected 6 tests, saw 3
    ../t/run/switches.t.....................FAILED at test 29
    ../t/cpan/Test-Simple/t/Builder/is_passing.tFAILED--no leader found
    ../t/cpan/Test-Simple/t/plan_is_noplan.tFAILED--expected 1 tests, saw 0
    ../t/cpan/Test-Simple/t/note.t..........FAILED--expected 2 tests, saw 0
    ../t/cpan/Test-Simple/t/skipall.t.......FAILED at test 1
    ../t/cpan/Test-Simple/t/diag.t..........FAILED--expected 7 tests, saw 0
    ../t/cpan/Test-Harness/t/unicode.t......FAILED at test 14
    ../t/cpan/Test-Simple/t/extra.t.........FAILED--no leader found
    ../t/cpan/Test-Simple/t/subtest/basic.t.FAILED--expected 19 tests, saw 0
    ../lib/diagnostics.t....................FAILED--expected 6 tests, saw 2
    ../t/cpan/Test-Simple/t/Builder/create.tFAILED--expected 7 tests, saw 3
    ../t/cpan/Test-Simple/t/Builder/details.tFAILED--expected 9 tests, saw 1
    ../t/io/open.t..........................FAILED at test 111
    ../t/cpan/podlators/t/text-encoding.t...FAILED at test 5
    ../t/uni/fold.t.........................FAILED--no leader found
    ../t/re/fold_grind.t....................FAILED--no leader found
    ../t/cpan/Test-Simple/t/bail_out.t......FAILED--no leader found
    ../lib/warnings.t.......................FAILED at test 670
    ../t/cpan/Test-Simple/t/Builder/no_plan_at_all.tFAILED--expected 1 tests, saw 0
    ../t/re/pat_advanced.t..................FAILED--unexpected output at test 1243
    ../ext/PerlIO-scalar/t/scalar_ungetc.t..FAILED at test 3
    ../t/op/write.t.........................FAILED at test 329
    ../t/cpan/Test-Simple/t/fail_one.t......FAILED--no leader found
    ../ext/PerlIO-encoding/t/fallback.t.....FAILED--expected 9 tests, saw 0
    ../t/cpan/Test-Simple/t/fail.t..........FAILED--no leader found
    ../t/cpan/Test-Simple/t/subtest/die.t...FAILED--no leader found
    ../t/op/concat2.t.......................FAILED at test 1
    ../t/cpan/Test-Simple/t/Builder/done_testing_double.tFAILED--no leader found
    ../t/op/readline.t......................FAILED--expected 25 tests, saw 20
    ../t/cpan/CGI/t/request.t...............FAILED at test 32
    ../lib/overload.t.......................FAILED--no leader found
    ../t/cpan/List-Util/t/p_openhan.t.......FAILED at test 6
    ../t/io/perlio_leaks.t..................FAILED--non-zero wait status: 65280
    ../t/op/goto.t..........................FAILED at test 69
    ../t/cpan/List-Util/t/openhan.t.........FAILED at test 6
    ../t/cpan/Test-Simple/t/subtest/exceptions.tFAILED--expected 7 tests, saw 0
    ../t/op/filehandle.t....................FAILED at test 1
    ../t/op/gv.t............................FAILED at test 221
    ../t/cpan/Test-Simple/t/Builder/done_testing_plan_mismatch.tFAILED--no leader found
    ../t/re/reg_60508.t.....................FAILED at test 1
    ../t/cpan/Test-Simple/t/Builder/reset.t.FAILED--no leader found
    ../t/op/warn.t..........................FAILED at test 20
    ../t/cpan/Test-Simple/t/undef.t.........FAILED--expected 21 tests, saw 16

[default] -DDEBUGGING -Uuseperlio
Inconsistent test results (between TEST and harness):
    ../t/cpan/Test-Simple/t/Builder/output.tFAILED--expected 6 tests, saw 3
    ../t/run/switches.t.....................FAILED at test 29
    ../t/cpan/Test-Simple/t/Builder/is_passing.tFAILED--no leader found
    ../t/cpan/Test-Simple/t/plan_is_noplan.tFAILED--expected 1 tests, saw 0
    ../t/cpan/Test-Simple/t/note.t..........FAILED--expected 2 tests, saw 0
    ../t/cpan/Test-Harness/t/unicode.t......FAILED at test 14
    ../t/cpan/Test-Simple/t/diag.t..........FAILED--expected 7 tests, saw 0
    ../t/cpan/Test-Simple/t/skipall.t.......FAILED at test 1
    ../t/cpan/Test-Simple/t/extra.t.........FAILED--no leader found
    ../t/cpan/Test-Simple/t/subtest/basic.t.FAILED--expected 19 tests, saw 0
    ../lib/diagnostics.t....................FAILED--expected 6 tests, saw 2
    ../t/cpan/Test-Simple/t/Builder/create.tFAILED--expected 7 tests, saw 3
    ../t/cpan/Test-Simple/t/Builder/details.tFAILED--expected 9 tests, saw 1
    ../t/io/open.t..........................FAILED at test 111
    ../t/uni/fold.t.........................FAILED--no leader found
    ../t/cpan/podlators/t/text-encoding.t...FAILED at test 5
    ../t/re/fold_grind.t....................FAILED--no leader found
    ../t/cpan/Test-Simple/t/bail_out.t......FAILED--no leader found
    ../lib/warnings.t.......................FAILED at test 670
    ../t/cpan/Test-Simple/t/Builder/no_plan_at_all.tFAILED--expected 1 tests, saw 0
    ../t/re/pat_advanced.t..................FAILED--unexpected output at test 1243
    ../ext/PerlIO-scalar/t/scalar_ungetc.t..FAILED at test 3
    ../t/op/write.t.........................FAILED at test 329
    ../t/cpan/Test-Simple/t/fail_one.t......FAILED--no leader found
    ../ext/PerlIO-encoding/t/fallback.t.....FAILED--expected 9 tests, saw 0
    ../t/cpan/Test-Simple/t/fail.t..........FAILED--no leader found
    ../t/cpan/Test-Simple/t/subtest/die.t...FAILED--no leader found
    ../t/op/concat2.t.......................FAILED at test 1
    ../t/cpan/Test-Simple/t/Builder/done_testing_double.tFAILED--no leader found
    ../t/op/readline.t......................FAILED--expected 25 tests, saw 20
    ../t/cpan/CGI/t/request.t...............FAILED at test 32
    ../lib/overload.t.......................FAILED--no leader found
    ../t/cpan/List-Util/t/p_openhan.t.......FAILED at test 6
    ../t/io/perlio_leaks.t..................FAILED--non-zero wait status: 65280
    ../t/op/goto.t..........................FAILED at test 69
    ../t/cpan/List-Util/t/openhan.t.........FAILED at test 6
    ../t/cpan/Test-Simple/t/subtest/exceptions.tFAILED--expected 7 tests, saw 0
    ../t/op/filehandle.t....................FAILED at test 1
    ../t/op/gv.t............................FAILED at test 221
    ../t/re/reg_60508.t.....................FAILED at test 1
    ../t/cpan/Test-Simple/t/Builder/done_testing_plan_mismatch.tFAILED--no leader found
    ../t/op/warn.t..........................FAILED at test 20
    ../t/cpan/Test-Simple/t/Builder/reset.t.FAILED--no leader found
    ../t/cpan/Test-Simple/t/undef.t.........FAILED--expected 21 tests, saw 16

[default] -Duse64bitint
[default] -DDEBUGGING -Duse64bitint
    ../lib/Tie/Array/std.t......................................FAILED
        91
    ../t/op/array.t.............................................FAILED
        91

Compiler messages(gcc):
Couldn't examine '/home/njh/perl5/perl-build-smoker/5.14.x.log' for compiler warnings.

-- 
Report by Test::Smoke v1.53 build 1374 running on perl 5.14.2
(Reporter v0.050 / Smoker v0.045)



nntp.perl.org: Perl Programming lists via nntp and http.
Comments to Ask Bjørn Hansen at ask@perl.org | Group listing | About