develooper Front page | perl.perl5.porters | Postings from September 2014

Smoke [5.10.1] perl-5.10.1-6-ge94431a FAIL(F) linux 3.0.35-cm-fx6-6.1[debian] (armv7l/4 cpu)

From:
njh
Date:
September 10, 2014 20:27
Subject:
Smoke [5.10.1] perl-5.10.1-6-ge94431a FAIL(F) linux 3.0.35-cm-fx6-6.1[debian] (armv7l/4 cpu)
Message ID:
201409102027.s8AKRP0m022109@compaq.bandsman.co.uk
Automated smoke report for 5.10.1 patch e94431af0ada74486afd65207f3e0345fe7485fe perl-5.10.1-6-ge94431a
utilite:  ( 0MHz) (armv7l/4 cpu)
    on        linux - 3.0.35-cm-fx6-6.1 [debian]
    using     cc version 4.7.2
    smoketime 11 hours 17 minutes (average 1 hour 36 minutes)

Summary: FAIL(F)

O = OK  F = Failure(s), extended report at the bottom
X = Failure(s) under TEST but not under harness
? = still running or test results not (yet) available
Build failures during:       - = unknown or N/A
c = Configure, m = make, M = make (after miniperl), t = make test-prep

perl-5.10.1-6-ge94431a  Configuration (common) none
----------- ---------------------------------------------------------
F - F -     -Uuseperlio
F F F F     
F F F F     -Duse64bitint
? - - -     -Duselongdouble
| | | +----- PERLIO = perlio -DDEBUGGING
| | +------- PERLIO = stdio  -DDEBUGGING
| +--------- PERLIO = perlio
+----------- PERLIO = stdio


Locally applied patches:
    SMOKEe94431af0ada74486afd65207f3e0345fe7485fe

Failures: (common-args) none
[stdio] -Uuseperlio
[stdio] -DDEBUGGING -Uuseperlio
    ../ext/List-Util/t/openhan.t................................FAILED
        6
        Non-zero exit status: 1
    ../ext/List-Util/t/p_openhan.t..............................FAILED
        6
        Non-zero exit status: 1
    ../ext/ODBM_File/t/odbm.t...................................FAILED
        Non-zero exit status: 127
        No plan found in TAP output
    ../ext/PerlIO-scalar/t/scalar_ungetc.t......................FAILED
        3-5, 7-8, 10-20
        Non-zero exit status: 16
    ../ext/Test-Harness/t/unicode.t.............................FAILED
        14
        Non-zero exit status: 1
    ../lib/DBM_Filter/t/01error.t...............................FAILED
        Non-zero exit status: 127
        Bad plan.  You planned 21 tests but ran 3.
    ../lib/Memoize/t/errors.t...................................FAILED
        Bad plan.  You planned 11 tests but ran 6.
    ../lib/Module/Build/t/script_dist.t.........................FAILED
        Non-zero exit status: 2
    ../lib/Pod/t/man-utf8.t.....................................FAILED
        3, 5
    ../lib/Pod/t/text-encoding.t................................FAILED
        3-4
    ../lib/Test/Simple/t/Builder/create.t.......................FAILED
        Non-zero exit status: 22
        Bad plan.  You planned 7 tests but ran 3.
    ../lib/Test/Simple/t/Builder/details.t......................FAILED
        Non-zero exit status: 22
        Bad plan.  You planned 9 tests but ran 1.
    ../lib/Test/Simple/t/Builder/done_testing_double.t..........FAILED
        Non-zero exit status: 22
        No plan found in TAP output
    ../lib/Test/Simple/t/Builder/done_testing_plan_mismatch.t...FAILED
        Non-zero exit status: 22
        No plan found in TAP output
    ../lib/Test/Simple/t/Builder/no_plan_at_all.t...............FAILED
        Non-zero exit status: 22
        Bad plan.  You planned 1 tests but ran 0.
    ../lib/Test/Simple/t/Builder/output.t.......................FAILED
        Non-zero exit status: 22
        Bad plan.  You planned 6 tests but ran 3.
    ../lib/Test/Simple/t/Builder/reset.t........................FAILED
        Non-zero exit status: 22
        No plan found in TAP output
    ../lib/Test/Simple/t/bail_out.t.............................FAILED
        Non-zero exit status: 22
        No plan found in TAP output
    ../lib/Test/Simple/t/diag.t.................................FAILED
        Non-zero exit status: 22
        Bad plan.  You planned 7 tests but ran 0.
    ../lib/Test/Simple/t/fail.t.................................FAILED
        Non-zero exit status: 22
        No plan found in TAP output
    ../lib/Test/Simple/t/fail_one.t.............................FAILED
        Non-zero exit status: 22
        No plan found in TAP output
    ../lib/Test/Simple/t/note.t.................................FAILED
        Non-zero exit status: 22
        Bad plan.  You planned 2 tests but ran 0.
    ../lib/Test/Simple/t/plan_is_noplan.t.......................FAILED
        Non-zero exit status: 22
        Bad plan.  You planned 1 tests but ran 0.
    ../lib/Test/Simple/t/skipall.t..............................FAILED
        1
        Non-zero exit status: 22
    ../lib/Test/Simple/t/undef.t................................FAILED
        Non-zero exit status: 22
        Bad plan.  You planned 21 tests but ran 16.
    ../t/io/perlio_leaks.t......................................FAILED
        Non-zero exit status: 255
    ../t/run/switches.t.........................................FAILED
        29

[stdio/perlio] 
[stdio/perlio] -DDEBUGGING
    ../ext/ODBM_File/t/odbm.t...................................FAILED
        Non-zero exit status: 127
        No plan found in TAP output
    ../lib/DBM_Filter/t/01error.t...............................FAILED
        Non-zero exit status: 127
        Bad plan.  You planned 21 tests but ran 3.
    ../lib/Memoize/t/errors.t...................................FAILED
        Bad plan.  You planned 11 tests but ran 6.

[stdio/perlio] -Duse64bitint
[stdio/perlio] -DDEBUGGING -Duse64bitint
    ../ext/ODBM_File/t/odbm.t...................................FAILED
        Non-zero exit status: 127
        No plan found in TAP output
    ../lib/DBM_Filter/t/01error.t...............................FAILED
        Non-zero exit status: 127
        Bad plan.  You planned 21 tests but ran 3.
    ../lib/Memoize/t/errors.t...................................FAILED
        Bad plan.  You planned 11 tests but ran 6.
    ../lib/Tie/Array/std.t......................................FAILED
        91
    ../t/op/array.t.............................................FAILED
        91

Compiler messages(gcc):
Couldn't examine '/home/njh/perl5/perl-build-smoker/5.10.x.log' for compiler warnings.

-- 
Report by Test::Smoke v1.53 build 1374 running on perl 5.14.2
(Reporter v0.050 / Smoker v0.045)



nntp.perl.org: Perl Programming lists via nntp and http.
Comments to Ask Bjørn Hansen at ask@perl.org | Group listing | About