develooper Front page | perl.perl5.porters | Postings from September 2014

Smoke [5.8.9] maint-5.8-10-g5d97567 FAIL(F) linux 3.0.35-cm-fx6-6.1[debian] (armv7l/4 cpu)

From:
njh
Date:
September 10, 2014 19:27
Subject:
Smoke [5.8.9] maint-5.8-10-g5d97567 FAIL(F) linux 3.0.35-cm-fx6-6.1[debian] (armv7l/4 cpu)
Message ID:
201409101927.s8AJRJE8019709@compaq.bandsman.co.uk
Automated smoke report for 5.8.9 patch 5d97567dd5d99fd909fe6858c74f7b2ca0ad9772 maint-5.8-10-g5d97567
utilite:  ( 0MHz) (armv7l/4 cpu)
    on        linux - 3.0.35-cm-fx6-6.1 [debian]
    using     cc version 4.7.2
    smoketime 11 hours 48 minutes (average 59 minutes 4 seconds)

Summary: FAIL(F)

O = OK  F = Failure(s), extended report at the bottom
X = Failure(s) under TEST but not under harness
? = still running or test results not (yet) available
Build failures during:       - = unknown or N/A
c = Configure, m = make, M = make (after miniperl), t = make test-prep

maint-5.8-10-g5d97567  Configuration (common) none
----------- ---------------------------------------------------------
F - F -     -Uuseperlio
F F F F     
F F F F     -Duse64bitint
F F F F     -Duselongdouble
F F F F     -Dusemorebits
F F - -     -Duseithreads
| | | +----- PERLIO = perlio -DDEBUGGING
| | +------- PERLIO = stdio  -DDEBUGGING
| +--------- PERLIO = perlio
+----------- PERLIO = stdio


Locally applied patches:
    MAINT35104
    SMOKE5d97567dd5d99fd909fe6858c74f7b2ca0ad9772

Failures: (common-args) none
[stdio] -Uuseperlio
[stdio] -DDEBUGGING -Uuseperlio
[stdio/perlio] 
[stdio/perlio] -DDEBUGGING
[stdio/perlio] -Duselongdouble
[stdio/perlio] -DDEBUGGING -Duselongdouble
[stdio/perlio] -Duseithreads
    ../ext/ODBM_File/t/odbm.t...............FAILED ??
    ../lib/DBM_Filter/t/01error.t...........FAILED 4-21
    ../lib/Memoize/t/errors.t...............FAILED 7-11

[stdio/perlio] -Duse64bitint
[perlio] -DDEBUGGING -Duse64bitint
[stdio/perlio] -Dusemorebits
[stdio/perlio] -DDEBUGGING -Dusemorebits
    ../ext/ODBM_File/t/odbm.t...............FAILED ??
    ../lib/DBM_Filter/t/01error.t...........FAILED 4-21
    ../lib/Memoize/t/errors.t...............FAILED 7-11
    ../lib/Tie/Array/std.t..................FAILED 91
    ../t/op/array.t.........................FAILED 91

[stdio] -DDEBUGGING -Duse64bitint
    ../ext/ODBM_File/t/odbm.t...............FAILED ??
    ../lib/DBM_Filter/t/01error.t...........FAILED 4-21
    ../lib/Memoize/t/errors.t...............FAILED 7-11
    ../lib/Tie/Array/std.t..................FAILED 91
    ../t/op/array.t.........................FAILED 91
Inconsistent test results (between TEST and harness):
    ../lib/Math/BigInt/t/sub_mbi.t..........FAILED at test 1344

Compiler messages(gcc):
Couldn't examine '/home/njh/perl5/perl-build-smoker/5.8.x.log' for compiler warnings.

-- 
Report by Test::Smoke v1.53 build 1374 running on perl 5.14.2
(Reporter v0.050 / Smoker v0.045)



nntp.perl.org: Perl Programming lists via nntp and http.
Comments to Ask Bjørn Hansen at ask@perl.org | Group listing | About