develooper Front page | perl.perl5.porters | Postings from August 2014

Smoke [blead] v5.21.3-65-gb51533f FAIL(F) MSWin32 Win2000 SP4 (x86/1 cpu) {blead}

From:
George Greer
Date:
August 22, 2014 18:22
Subject:
Smoke [blead] v5.21.3-65-gb51533f FAIL(F) MSWin32 Win2000 SP4 (x86/1 cpu) {blead}
Message ID:
20140822182225.AC3034E0581@zwei

Automated smoke report for 5.21.4 patch b51533f3c738c0d34d686dc15720c781f1043802 v5.21.3-65-gb51533f
perl-win2k: Intel(R) Core(TM) i7 CPU 920 @ 2.67GHz(~2654 MHz) (x86/1 cpu)
    on        MSWin32 - Win2000 SP4
    using     cl version 14.00.50727.762
    smoketime 3 hours 44 minutes (average 56 minutes 5 seconds)

Summary: FAIL(F)

O = OK  F = Failure(s), extended report at the bottom
X = Failure(s) under TEST but not under harness
? = still running or test results not (yet) available
Build failures during:       - = unknown or N/A
c = Configure, m = make, M = make (after miniperl), t = make test-prep

v5.21.3-65-gb51533f  Configuration (common) none
----------- ---------------------------------------------------------
F F         
F F         -Duseithreads
| +--------- -DDEBUGGING
+----------- no debugging


Locally applied patches:
    SMOKEb51533f3c738c0d34d686dc15720c781f1043802

Failures: (common-args) none
[default] 
[default] -DDEBUGGING
[default] -Duseithreads
../t/op/infnan.t............................................FAILED
    1-6, 8-9, 11-12, 14-15, 17-18, 20-22, 24-25
    27, 29-30, 32-33, 35-36, 38-39, 41-43, 45-46
    48
    Non-zero exit status: 255
    Bad plan.  You planned 91 tests but ran 50.
../ext/B/t/concise-xs.t.....................................FAILED
    1200
    Non-zero exit status: 1

[default] -DDEBUGGING -Duseithreads
../t/op/infnan.t............................................FAILED
    1-6, 8-9, 11-12, 14-15, 17-18, 20-22, 24-25
    27, 29-30, 32-33, 35-36, 38-39, 41-43, 45-46
    48
    Non-zero exit status: 255
    Bad plan.  You planned 91 tests but ran 50.
../cpan/IPC-Cmd/t/01_IPC-Cmd.t..............................FAILED
    20
    Non-zero exit status: 1
../ext/B/t/concise-xs.t.....................................FAILED
    1200
    Non-zero exit status: 1

Compiler messages(MSWin32):
..\sv.c(10809) : warning C4244: 'initializing' : conversion from 'double' to 'unsigned __int64', possible loss of data
d:\smoke\perl\blead\build\numeric.c(1355) : warning C4715: 'Perl_signbit' : not all control paths return a value
RealPPPort.xs(1864) : warning C4101: 'len' : unreferenced local variable
Base64.xs(394) : warning C4146: unary minus operator applied to unsigned type, result still unsigned
Base64.xs(396) : warning C4146: unary minus operator applied to unsigned type, result still unsigned
-- 
Report by Test::Smoke v1.53 build 1374 running on perl 5.10.0
(Reporter v0.050 / Smoker v0.045)




nntp.perl.org: Perl Programming lists via nntp and http.
Comments to Ask Bjørn Hansen at ask@perl.org | Group listing | About