develooper Front page | perl.perl5.porters | Postings from September 2013

mostly known: 12 distros FAILing tests or build on 5.19.4

From:
Danny Thomas
Date:
September 28, 2013 22:39
Subject:
mostly known: 12 distros FAILing tests or build on 5.19.4
Message ID:
E358D2AD85D24A44BFBA062E49DD13D991022F@UQEXMDA6.soe.uq.edu.au
4361.1:   0/25  Coro-6.31.tar.gz 25 failed
State.xs: In function ‘swap_sv’:
State.xs:669: error: ‘SVt_BIND’ undeclared (first use in this function)
State.xs:669: error: (Each undeclared identifier is reported only once
State.xs:669: error: for each function it appears in.)
http://matrix.cpantesters.org/?dist=Coro+6.31 suggests failure started with 5.19
I just created https://rt.cpan.org/Public/Bug/Display.html?id=89018


4361.1:   0/4   Net-SSH-Mechanize-0.1.3.tar.gz 4 failed
t/01.pod.t .................. 1/4
#   Failed test 'POD test for blib/lib/Net/SSH/Mechanize.pm'
#   at /opt/perl/cis.perl-base2.rhel6-5.19.4.20130927/lib/site_perl/5.19.4/Test/Pod.pm line 186.
# blib/lib/Net/SSH/Mechanize.pm (415): L<> starts or ends with whitespace
# Looks like you failed 1 test of 4.
t/01.pod.t .................. Dubious, test returned 1 (wstat 256, 0x100)
Failed 1/4 subtests
...
t/02.multi-capture.t ........ Can't locate Coro.pm in @INC  (see above)
https://rt.cpan.org/Public/Bug/Display.html?id=8555585553  (my report against 5.18)


4361.1:   0/2   Data-Dump-Streamer-2.36.tar.gz 2 failed
https://rt.cpan.org/Public/Bug/Display.html?id=88202
http://matrix.cpantesters.org/?dist=Data-Dump-Streamer+2.36 suggests failure started with 5.18
https://rt.cpan.org/Public/Bug/Display.html?id=88202 (5.19.3)
https://rt.cpan.org/Public/Bug/Display.html?id=85670 (originally for 5.18)

4361.1:   0/12  Tail-Tool-v0.3.5.tar.gz 12 failed
     Error:  Can't locate Data/Dump/Streamer.pm in @INC
4361.1:   0/1   XML-Compile-Dumper-0.13.tar.gz 1 failed
     Error:  Can't locate Data/Dump/Streamer.pm in @INC


4361.1:   0/2   Net-Radius-2.103.tar.gz 2 failed  (2.103 from 2009)
t/00-pod.t ..... 1/2
#   Failed test 'POD test for blib/lib/Net/Radius/Dictionary.pm'
#   at /opt/perl/cis.perl-base2.rhel6-5.19.4.20130927/lib/site_perl/5.19.4/Test/Pod.pm line 186.
# blib/lib/Net/Radius/Dictionary.pm (380): Non-ASCII character seen before =encoding in 'Mu?oz'. Assuming UTF-8

#   Failed test 'POD test for blib/lib/Net/Radius/Packet.pm'
#   at /opt/perl/cis.perl-base2.rhel6-5.19.4.20130927/lib/site_perl/5.19.4/Test/Pod.pm line 186.
# blib/lib/Net/Radius/Packet.pm (1002): Non-ASCII character seen before =encoding in 'Mu?oz,'. Assuming UTF-8
# Looks like you failed 2 tests of 2.
t/00-pod.t ..... Dubious, test returned 2 (wstat 512, 0x200)
https://rt.cpan.org/Public/Bug/Display.html?id=85553  (my report against 5.18)
Another distro having end user run pod tests


4361.1:   0/1   Devel-Size-0.79.tar.gz 1 failed
t/magic.t ..... 1/18
#   Failed test 'the magic object is counted'
#   at t/magic.t line 55.
#     '1248'
#         >
#     '1256'
# Looks like you failed 1 test of 18.
https://rt.cpan.org/Public/Bug/Display.html?id=88180  (includes patch)


4361.1:   0/161 Devel-Trepan-0.50.tar.gz 161 failed
https://github.com/rocky/Perl-Devel-Trepan/issues/20

4361.1:   0/2   Devel-Trepan-Disassemble-1.9.tar.gz 2 failed
Can't locate Devel/Trepan.pm in @INC


4361.1:   0/1   IMAP-Client-0.13.tar.gz 1 failed  (0.13 from 2006)
t/04parsefetch.t ..... 1/165
#   Failed test at t/04parsefetch.t line 88.
#          got: undef
#     expected: '10'

#   Failed test at t/04parsefetch.t line 89.
#          got: undef
#     expected: '22'

#   Failed test at t/04parsefetch.t line 90.
#          got: undef
#     expected: 'one be so kinda as to '
# Looks like you failed 3 tests of 165.
I created https://rt.cpan.org/Public/Bug/Display.html?id=89019


4361.1:   0/1   MooseX-Types-Parameterizable-0.08.tar.gz 1 failed
https://rt.cpan.org/Public/Bug/Display.html?id=85551  (my report against 5.18)


4361.1:   0/28  Mouse-1.11.tar.gz 28 failed
https://rt.cpan.org/Public/Bug/Display.html?id=88295  (includes patch)



3861.1:   chdir to <BUILD>/DBIx-Class-IntrospectableM2M-0.001001 and a dozen other distros
3861.1:   <DISTRO-PERL> Makefile.PL  && make && make test && make install
Cannot determine perl version info from lib/DBIx/Class/IntrospectableM2M.pm
Checking if your kit is complete...
Looks good
Generating a GNU-style Makefile
Writing Makefile for DBIx::Class::IntrospectableM2M
Possible precedence issue with control flow operator at .../lib/site_perl/5.19.4/JSON/PP.pm line 1567.


t/e02_bool.t ................ Possible precedence issue with control flow operator at .../JSON-2.59/blib/lib/JSON/backportPP.pm line 1573.
t

JSON-2.59 has
t/00_modules.t ................................ Possible precedence issue with control flow operator at .../Perl-Critic-1.119/blib/lib/Perl/Critic/Utils.pm line 334.


several distros including Devel-StackTrace-AsHTML-0.14 have this
t/00-compile.t .. Possible precedence issue with control flow operator at /opt/work/cis.perl.build/cis.perl.build-5.19.4.rhel6.20130927/tarball-build-base2/URI-Fetch-0.09/inc/Test/Builder.pm line 915.
t/00_compile.t .. Possible precedence issue with control flow operator at /opt/work/cis.perl.build/cis.perl.build-5.19.4.rhel6.20130927/tarball-build-base2/Devel-StackTrace-AsHTML-0.14/inc/Test/Builder.pm line 917.

ExtUtils-MakeMaker-6.78
Possible precedence issue with control flow operator at bundled/JSON-PP/JSON/PP.pm line 1567.
t/xs.t .................... Possible precedence issue with control flow operator at t/lib/Test/Builder.pm line 632.




nntp.perl.org: Perl Programming lists via nntp and http.
Comments to Ask Bjørn Hansen at ask@perl.org | Group listing | About