develooper Front page | perl.perl5.porters | Postings from September 2013

Smoke [blead] v5.19.3-545-gcfbe45f FAIL(M) linux 3.8.0-29-generic [debian] (x86_64/8 cpu) {blead_clang}

From:
George Greer
Date:
September 15, 2013 09:57
Subject:
Smoke [blead] v5.19.3-545-gcfbe45f FAIL(M) linux 3.8.0-29-generic [debian] (x86_64/8 cpu) {blead_clang}
Message ID:
201309150956.r8F9ulfd025609@m-l.org
Smoke logs available at http://m-l.org/~perl/smoke/perl/linux/blead_clang/logcfbe45f9db60b40885dfa66aeec6ed3050dba6d4.log.gz

Automated smoke report for 5.19.4 patch cfbe45f9db60b40885dfa66aeec6ed3050dba6d4 v5.19.3-545-gcfbe45f
zwei: Intel(R) Core(TM) i7 CPU 920 @ 2.67GHz (GenuineIntel 1600MHz) (x86_64/8 cpu)
    on        linux - 3.8.0-29-generic [debian]
    using     clang version 4.2.1 Compatible Clang 3.4 (trunk 189633)
    smoketime 1 hour 32 minutes (average 3 minutes 51.625 seconds)

Summary: FAIL(M)

O = OK  F = Failure(s), extended report at the bottom
X = Failure(s) under TEST but not under harness
? = still running or test results not (yet) available
Build failures during:       - = unknown or N/A
c = Configure, m = make, M = make (after miniperl), t = make test-prep

v5.19.3-545-gcfbe45f  Configuration (common) -Dcc=clang
----------- ---------------------------------------------------------
M - - M - - 
M - - M - - -Accflags=-DPERL_POISON
M - - M - - -Duse64bitall -Accflags=-DPERL_GLOBAL_STRUCT
M - - M - - -Dusemorebits -Accflags=-DPERL_GLOBAL_STRUCT_PRIVATE
M - - M - - -Dmad
M - - M - - -Accflags=-DPERL_NO_COW
M - - M - - -Duseithreads
M - - M - - -Duseithreads -Accflags=-DPERL_POISON
M - - M - - -Duseithreads -Duse64bitall -Accflags=-DPERL_GLOBAL_STRUCT
M - - M - - -Duseithreads -Dusemorebits -Accflags=-DPERL_GLOBAL_STRUCT_PRIVATE
M - - M - - -Duseithreads -Dmad
M - - M - - -Duseithreads -Accflags=-DPERL_NO_COW
| | | +----- PERLIO = perlio -DDEBUGGING
| | +------- PERLIO = stdio  -DDEBUGGING
| +--------- PERLIO = perlio
+----------- PERLIO = stdio


Locally applied patches:
    SMOKEcfbe45f9db60b40885dfa66aeec6ed3050dba6d4

Failures: (common-args) -Dcc=clang
[minitest] 
[minitest] -DDEBUGGING -Accflags=-DPERL_POISON
[minitest] -Duse64bitall -Accflags=-DPERL_GLOBAL_STRUCT
[minitest] -DDEBUGGING -Duse64bitall -Accflags=-DPERL_GLOBAL_STRUCT
[minitest] -DDEBUGGING -Duseithreads
[minitest] -Duseithreads -Dusemorebits -Accflags=-DPERL_GLOBAL_STRUCT_PRIVATE
[minitest] -DDEBUGGING -Duseithreads -Dusemorebits -Accflags=-DPERL_GLOBAL_STRUCT_PRIVATE
[minitest] -DDEBUGGING -Duseithreads -Accflags=-DPERL_NO_COW
    t/comp/hints ................... FAILED--expected 31 tests, saw 10
    t/comp/require ................. FAILED at test 52
    t/run/switchM .................. FAILED at test 1
    t/run/switches ................. FAILED--no leader found
    t/io/crlf ...................... FAILED--expected 16416 tests, saw 16
    t/io/open ...................... FAILED--no leader found
    t/io/utf8 ...................... FAILED--expected 61 tests, saw 52
    t/re/charset ................... FAILED at test 691
    t/re/overload .................. FAILED--no leader found
    t/re/pat ....................... FAILED--no leader found
    t/re/pat_special_cc ............ FAILED--expected 9 tests, saw 3
    t/re/reg_mesg .................. FAILED--no leader found
    t/re/regex_sets ................ FAILED--no leader found
    t/re/regex_sets_compat ......... FAILED at test 149
    t/re/regexp .................... FAILED at test 122
    t/re/regexp_noamp .............. FAILED at test 122
    t/re/regexp_notrie ............. FAILED at test 122
    t/re/regexp_qr ................. FAILED at test 122
    t/re/regexp_qr_embed ........... FAILED at test 122
    t/re/regexp_trielist ........... FAILED at test 122
    t/re/rxcode .................... FAILED--no leader found
    t/re/uniprops .................. FAILED--no leader found
    t/opbasic/qq ................... FAILED at test 28
    t/op/closure ................... FAILED--no leader found
    t/op/die ....................... FAILED at test 18
    t/op/eval ...................... FAILED at test 124
    t/op/filetest .................. FAILED--expected 431 tests, saw 33
    t/op/fresh_perl_utf8 ........... FAILED at test 1
    t/op/lc ........................ FAILED--no leader found
    t/op/ref ....................... FAILED--expected 235 tests, saw 137
    t/op/substr .................... FAILED--no leader found
    t/op/tr ........................ FAILED--no leader found
    t/op/utf8cache ................. FAILED--no leader found
    t/op/utfhash ................... FAILED--expected 99 tests, saw 37
    t/uni/bless .................... FAILED--no leader found
    t/uni/cache .................... FAILED--no leader found
    t/uni/caller ................... FAILED--expected 18 tests, saw 0
    t/uni/class .................... FAILED--no leader found
    t/uni/fold ..................... FAILED--no leader found
    t/uni/goto ..................... FAILED--no leader found
    t/uni/gv ....................... FAILED--no leader found
    t/uni/labels ................... FAILED--no leader found
    t/uni/lower .................... FAILED--no leader found
    t/uni/method ................... FAILED--no leader found
    t/uni/opcroak .................. FAILED at test 1
    t/uni/package .................. FAILED--no leader found
    t/uni/parser ................... FAILED--no leader found
    t/uni/readline ................. FAILED--no leader found
    t/uni/select ................... FAILED--no leader found
    t/uni/stash .................... FAILED--no leader found
    t/uni/title .................... FAILED--no leader found
    t/uni/upper .................... FAILED--no leader found
    t/uni/variables ................ FAILED--no leader found
    t/uni/write .................... FAILED--expected 8 tests, saw 6

[minitest] -DDEBUGGING
[minitest] -DDEBUGGING -Dusemorebits -Accflags=-DPERL_GLOBAL_STRUCT_PRIVATE
[minitest] -Duseithreads
[minitest] -DDEBUGGING -Duseithreads -Accflags=-DPERL_POISON
[minitest] -DDEBUGGING -Duseithreads -Duse64bitall -Accflags=-DPERL_GLOBAL_STRUCT
    t/comp/hints ................... FAILED--expected 31 tests, saw 10
    t/comp/require ................. FAILED at test 52
    t/run/switchM .................. FAILED at test 1
    t/run/switches ................. FAILED--no leader found
    t/io/crlf ...................... FAILED--expected 16416 tests, saw 16
    t/io/open ...................... FAILED--no leader found
    t/io/utf8 ...................... FAILED--expected 61 tests, saw 52
    t/re/charset ................... FAILED at test 691
    t/re/overload .................. FAILED--no leader found
    t/re/pat ....................... FAILED--no leader found
    t/re/pat_special_cc ............ FAILED--expected 9 tests, saw 3
    t/re/reg_mesg .................. FAILED--no leader found
    t/re/regex_sets ................ FAILED--no leader found
    t/re/regex_sets_compat ......... FAILED at test 149
    t/re/regexp .................... FAILED at test 122
    t/re/regexp_noamp .............. FAILED at test 122
    t/re/regexp_notrie ............. FAILED at test 122
    t/re/regexp_qr ................. FAILED at test 122
    t/re/regexp_qr_embed ........... FAILED at test 122
    t/re/regexp_trielist ........... FAILED at test 122
    t/re/rxcode .................... FAILED--no leader found
    t/re/uniprops .................. FAILED--no leader found
    t/opbasic/qq ................... FAILED at test 28
    t/op/closure ................... FAILED--no leader found
    t/op/die ....................... FAILED at test 18
    t/op/eval ...................... FAILED at test 124
    t/op/filetest .................. FAILED--expected 431 tests, saw 33
    t/op/fresh_perl_utf8 ........... FAILED at test 1
    t/op/lc ........................ FAILED--no leader found
    t/op/ref ....................... FAILED--expected 235 tests, saw 137
    t/op/substr .................... FAILED--no leader found
    t/op/tr ........................ FAILED--no leader found
    t/op/utf8cache ................. FAILED--no leader found
    t/op/utfhash ................... FAILED--expected 99 tests, saw 39
    t/uni/bless .................... FAILED--no leader found
    t/uni/cache .................... FAILED--no leader found
    t/uni/caller ................... FAILED--expected 18 tests, saw 0
    t/uni/class .................... FAILED--no leader found
    t/uni/fold ..................... FAILED--no leader found
    t/uni/goto ..................... FAILED--no leader found
    t/uni/gv ....................... FAILED--no leader found
    t/uni/labels ................... FAILED--no leader found
    t/uni/lower .................... FAILED--no leader found
    t/uni/method ................... FAILED--no leader found
    t/uni/opcroak .................. FAILED at test 1
    t/uni/package .................. FAILED--no leader found
    t/uni/parser ................... FAILED--no leader found
    t/uni/readline ................. FAILED--no leader found
    t/uni/select ................... FAILED--no leader found
    t/uni/stash .................... FAILED--no leader found
    t/uni/title .................... FAILED--no leader found
    t/uni/upper .................... FAILED--no leader found
    t/uni/variables ................ FAILED--no leader found
    t/uni/write .................... FAILED--expected 8 tests, saw 6

[minitest] -Accflags=-DPERL_POISON
[minitest] -Dusemorebits -Accflags=-DPERL_GLOBAL_STRUCT_PRIVATE
[minitest] -DDEBUGGING -Accflags=-DPERL_NO_COW
[minitest] -Duseithreads -Accflags=-DPERL_POISON
[minitest] -Duseithreads -Duse64bitall -Accflags=-DPERL_GLOBAL_STRUCT
    t/comp/hints ................... FAILED--expected 31 tests, saw 10
    t/comp/require ................. FAILED at test 52
    t/run/switchM .................. FAILED at test 1
    t/run/switches ................. FAILED--no leader found
    t/io/crlf ...................... FAILED--expected 16416 tests, saw 16
    t/io/open ...................... FAILED--no leader found
    t/io/utf8 ...................... FAILED--expected 61 tests, saw 52
    t/re/charset ................... FAILED at test 691
    t/re/overload .................. FAILED--no leader found
    t/re/pat ....................... FAILED--no leader found
    t/re/pat_special_cc ............ FAILED--expected 9 tests, saw 3
    t/re/reg_mesg .................. FAILED--no leader found
    t/re/regex_sets ................ FAILED--no leader found
    t/re/regex_sets_compat ......... FAILED at test 149
    t/re/regexp .................... FAILED at test 122
    t/re/regexp_noamp .............. FAILED at test 122
    t/re/regexp_notrie ............. FAILED at test 122
    t/re/regexp_qr ................. FAILED at test 122
    t/re/regexp_qr_embed ........... FAILED at test 122
    t/re/regexp_trielist ........... FAILED at test 122
    t/re/rxcode .................... FAILED--no leader found
    t/re/uniprops .................. FAILED--no leader found
    t/opbasic/qq ................... FAILED at test 28
    t/op/closure ................... FAILED--no leader found
    t/op/die ....................... FAILED at test 18
    t/op/eval ...................... FAILED at test 124
    t/op/filetest .................. FAILED--expected 431 tests, saw 33
    t/op/fresh_perl_utf8 ........... FAILED at test 1
    t/op/lc ........................ FAILED--no leader found
    t/op/ref ....................... FAILED--expected 235 tests, saw 137
    t/op/substr .................... FAILED--no leader found
    t/op/tr ........................ FAILED--no leader found
    t/op/utf8cache ................. FAILED--no leader found
    t/op/utfhash ................... FAILED--expected 99 tests, saw 38
    t/uni/bless .................... FAILED--no leader found
    t/uni/cache .................... FAILED--no leader found
    t/uni/caller ................... FAILED--expected 18 tests, saw 0
    t/uni/class .................... FAILED--no leader found
    t/uni/fold ..................... FAILED--no leader found
    t/uni/goto ..................... FAILED--no leader found
    t/uni/gv ....................... FAILED--no leader found
    t/uni/labels ................... FAILED--no leader found
    t/uni/lower .................... FAILED--no leader found
    t/uni/method ................... FAILED--no leader found
    t/uni/opcroak .................. FAILED at test 1
    t/uni/package .................. FAILED--no leader found
    t/uni/parser ................... FAILED--no leader found
    t/uni/readline ................. FAILED--no leader found
    t/uni/select ................... FAILED--no leader found
    t/uni/stash .................... FAILED--no leader found
    t/uni/title .................... FAILED--no leader found
    t/uni/upper .................... FAILED--no leader found
    t/uni/variables ................ FAILED--no leader found
    t/uni/write .................... FAILED--expected 8 tests, saw 6

[minitest] -Dmad
    t/comp/hints ................... FAILED--expected 31 tests, saw 10
    t/comp/require ................. FAILED at test 52
    t/run/mad ...................... FAILED--no leader found
    t/run/switchM .................. FAILED at test 1
    t/run/switches ................. FAILED--no leader found
    t/io/crlf ...................... FAILED--expected 16416 tests, saw 16
    t/io/open ...................... FAILED--no leader found
    t/io/utf8 ...................... FAILED--expected 61 tests, saw 52
    t/re/charset ................... FAILED at test 691
    t/re/overload .................. FAILED--no leader found
    t/re/pat ....................... FAILED--no leader found
    t/re/pat_special_cc ............ FAILED--expected 9 tests, saw 3
    t/re/reg_mesg .................. FAILED--no leader found
    t/re/regex_sets ................ FAILED--no leader found
    t/re/regex_sets_compat ......... FAILED at test 149
    t/re/regexp .................... FAILED at test 122
    t/re/regexp_noamp .............. FAILED at test 122
    t/re/regexp_notrie ............. FAILED at test 122
    t/re/regexp_qr ................. FAILED at test 122
    t/re/regexp_qr_embed ........... FAILED at test 122
    t/re/regexp_trielist ........... FAILED at test 122
    t/re/rxcode .................... FAILED--no leader found
    t/re/uniprops .................. FAILED--no leader found
    t/opbasic/qq ................... FAILED at test 28
    t/op/closure ................... FAILED--no leader found
    t/op/die ....................... FAILED at test 18
    t/op/eval ...................... FAILED at test 124
    t/op/filetest .................. FAILED--expected 431 tests, saw 33
    t/op/fresh_perl_utf8 ........... FAILED at test 1
    t/op/lc ........................ FAILED--no leader found
    t/op/ref ....................... FAILED--expected 235 tests, saw 137
    t/op/substr .................... FAILED--no leader found
    t/op/tr ........................ FAILED--no leader found
    t/op/utf8cache ................. FAILED--no leader found
    t/op/utfhash ................... FAILED--expected 99 tests, saw 39
    t/uni/bless .................... FAILED--no leader found
    t/uni/cache .................... FAILED--no leader found
    t/uni/caller ................... FAILED--expected 18 tests, saw 0
    t/uni/class .................... FAILED--no leader found
    t/uni/fold ..................... FAILED--no leader found
    t/uni/goto ..................... FAILED--no leader found
    t/uni/gv ....................... FAILED--no leader found
    t/uni/labels ................... FAILED--no leader found
    t/uni/lower .................... FAILED--no leader found
    t/uni/method ................... FAILED--no leader found
    t/uni/opcroak .................. FAILED at test 1
    t/uni/package .................. FAILED--no leader found
    t/uni/parser ................... FAILED--no leader found
    t/uni/readline ................. FAILED--no leader found
    t/uni/select ................... FAILED--no leader found
    t/uni/stash .................... FAILED--no leader found
    t/uni/title .................... FAILED--no leader found
    t/uni/upper .................... FAILED--no leader found
    t/uni/variables ................ FAILED--no leader found
    t/uni/write .................... FAILED--expected 8 tests, saw 6

[minitest] -DDEBUGGING -Dmad
[minitest] -Duseithreads -Dmad
[minitest] -DDEBUGGING -Duseithreads -Dmad
    t/comp/hints ................... FAILED--expected 31 tests, saw 10
    t/comp/require ................. FAILED at test 52
    t/run/mad ...................... FAILED--no leader found
    t/run/switchM .................. FAILED at test 1
    t/run/switches ................. FAILED--no leader found
    t/io/crlf ...................... FAILED--expected 16416 tests, saw 16
    t/io/open ...................... FAILED--no leader found
    t/io/utf8 ...................... FAILED--expected 61 tests, saw 52
    t/re/charset ................... FAILED at test 691
    t/re/overload .................. FAILED--no leader found
    t/re/pat ....................... FAILED--no leader found
    t/re/pat_special_cc ............ FAILED--expected 9 tests, saw 3
    t/re/reg_mesg .................. FAILED--no leader found
    t/re/regex_sets ................ FAILED--no leader found
    t/re/regex_sets_compat ......... FAILED at test 149
    t/re/regexp .................... FAILED at test 122
    t/re/regexp_noamp .............. FAILED at test 122
    t/re/regexp_notrie ............. FAILED at test 122
    t/re/regexp_qr ................. FAILED at test 122
    t/re/regexp_qr_embed ........... FAILED at test 122
    t/re/regexp_trielist ........... FAILED at test 122
    t/re/rxcode .................... FAILED--no leader found
    t/re/uniprops .................. FAILED--no leader found
    t/opbasic/qq ................... FAILED at test 28
    t/op/closure ................... FAILED--no leader found
    t/op/die ....................... FAILED at test 18
    t/op/eval ...................... FAILED at test 124
    t/op/filetest .................. FAILED--expected 431 tests, saw 33
    t/op/fresh_perl_utf8 ........... FAILED at test 1
    t/op/lc ........................ FAILED--no leader found
    t/op/ref ....................... FAILED--expected 235 tests, saw 137
    t/op/substr .................... FAILED--no leader found
    t/op/tr ........................ FAILED--no leader found
    t/op/utf8cache ................. FAILED--no leader found
    t/op/utfhash ................... FAILED--expected 99 tests, saw 37
    t/uni/bless .................... FAILED--no leader found
    t/uni/cache .................... FAILED--no leader found
    t/uni/caller ................... FAILED--expected 18 tests, saw 0
    t/uni/class .................... FAILED--no leader found
    t/uni/fold ..................... FAILED--no leader found
    t/uni/goto ..................... FAILED--no leader found
    t/uni/gv ....................... FAILED--no leader found
    t/uni/labels ................... FAILED--no leader found
    t/uni/lower .................... FAILED--no leader found
    t/uni/method ................... FAILED--no leader found
    t/uni/opcroak .................. FAILED at test 1
    t/uni/package .................. FAILED--no leader found
    t/uni/parser ................... FAILED--no leader found
    t/uni/readline ................. FAILED--no leader found
    t/uni/select ................... FAILED--no leader found
    t/uni/stash .................... FAILED--no leader found
    t/uni/title .................... FAILED--no leader found
    t/uni/upper .................... FAILED--no leader found
    t/uni/variables ................ FAILED--no leader found
    t/uni/write .................... FAILED--expected 8 tests, saw 6

[minitest] -Accflags=-DPERL_NO_COW
[minitest] -Duseithreads -Accflags=-DPERL_NO_COW
    t/comp/hints ................... FAILED--expected 31 tests, saw 10
    t/comp/require ................. FAILED at test 52
    t/run/switchM .................. FAILED at test 1
    t/run/switches ................. FAILED--no leader found
    t/io/crlf ...................... FAILED--expected 16416 tests, saw 16
    t/io/open ...................... FAILED--no leader found
    t/io/utf8 ...................... FAILED--expected 61 tests, saw 52
    t/re/charset ................... FAILED at test 691
    t/re/overload .................. FAILED--no leader found
    t/re/pat ....................... FAILED--no leader found
    t/re/pat_special_cc ............ FAILED--expected 9 tests, saw 3
    t/re/reg_mesg .................. FAILED--no leader found
    t/re/regex_sets ................ FAILED--no leader found
    t/re/regex_sets_compat ......... FAILED at test 149
    t/re/regexp .................... FAILED at test 122
    t/re/regexp_noamp .............. FAILED at test 122
    t/re/regexp_notrie ............. FAILED at test 122
    t/re/regexp_qr ................. FAILED at test 122
    t/re/regexp_qr_embed ........... FAILED at test 122
    t/re/regexp_trielist ........... FAILED at test 122
    t/re/rxcode .................... FAILED--no leader found
    t/re/uniprops .................. FAILED--no leader found
    t/opbasic/qq ................... FAILED at test 28
    t/op/closure ................... FAILED--no leader found
    t/op/die ....................... FAILED at test 18
    t/op/eval ...................... FAILED at test 124
    t/op/filetest .................. FAILED--expected 431 tests, saw 33
    t/op/fresh_perl_utf8 ........... FAILED at test 1
    t/op/lc ........................ FAILED--no leader found
    t/op/ref ....................... FAILED--expected 235 tests, saw 137
    t/op/substr .................... FAILED--no leader found
    t/op/tr ........................ FAILED--no leader found
    t/op/utf8cache ................. FAILED--no leader found
    t/op/utfhash ................... FAILED--expected 99 tests, saw 40
    t/uni/bless .................... FAILED--no leader found
    t/uni/cache .................... FAILED--no leader found
    t/uni/caller ................... FAILED--expected 18 tests, saw 0
    t/uni/class .................... FAILED--no leader found
    t/uni/fold ..................... FAILED--no leader found
    t/uni/goto ..................... FAILED--no leader found
    t/uni/gv ....................... FAILED--no leader found
    t/uni/labels ................... FAILED--no leader found
    t/uni/lower .................... FAILED--no leader found
    t/uni/method ................... FAILED--no leader found
    t/uni/opcroak .................. FAILED at test 1
    t/uni/package .................. FAILED--no leader found
    t/uni/parser ................... FAILED--no leader found
    t/uni/readline ................. FAILED--no leader found
    t/uni/select ................... FAILED--no leader found
    t/uni/stash .................... FAILED--no leader found
    t/uni/title .................... FAILED--no leader found
    t/uni/upper .................... FAILED--no leader found
    t/uni/variables ................ FAILED--no leader found
    t/uni/write .................... FAILED--expected 8 tests, saw 6

Compiler messages(gcc):
regexec.c:1067:35: warning: comparison of unsigned expression < 0 is always false [-Wtautological-compare]
regexec.c:1071:37: warning: comparison of unsigned expression < 0 is always false [-Wtautological-compare]
util.c:3329:12: warning: returning 'const MGVTBL *' (aka 'const struct mgvtbl *') from a function with result type 'MGVTBL *' (aka 'struct mgvtbl *') discards qualifiers [-Wincompatible-pointer-types-discards-qualifiers]
-- 
Report by Test::Smoke v1.53 build 1374 running on perl 5.14.2
(Reporter v0.050 / Smoker v0.045)




nntp.perl.org: Perl Programming lists via nntp and http.
Comments to Ask Bjørn Hansen at ask@perl.org | Group listing | About