develooper Front page | perl.perl5.porters | Postings from September 2013

Smoke [blead] v5.19.3-425-g52d097d FAIL(m) MSWin32 Win2000 SP4 (x86/1 cpu) {blead}

From:
George Greer
Date:
September 10, 2013 17:22
Subject:
Smoke [blead] v5.19.3-425-g52d097d FAIL(m) MSWin32 Win2000 SP4 (x86/1 cpu) {blead}
Message ID:
20130910172227.9AB174E027A@zwei

Automated smoke report for 5.19.4 patch 52d097d99176412041811ec3c8c663e4a912d2c7 v5.19.3-425-g52d097d
perl-win2k: Intel(R) Core(TM) i7 CPU 920 @ 2.67GHz(~2665 MHz) (x86/1 cpu)
    on        MSWin32 - Win2000 SP4
    using     ? unknown cc version 
    smoketime 3 minutes 48 seconds (average 57 seconds)

Summary: FAIL(m)

O = OK  F = Failure(s), extended report at the bottom
X = Failure(s) under TEST but not under harness
? = still running or test results not (yet) available
Build failures during:       - = unknown or N/A
c = Configure, m = make, M = make (after miniperl), t = make test-prep

v5.19.3-425-g52d097d  Configuration (common) none
----------- ---------------------------------------------------------
m m         
m m         -Duseithreads
| +--------- -DDEBUGGING
+----------- no debugging


Locally applied patches:
    SMOKE52d097d99176412041811ec3c8c663e4a912d2c7

Compiler messages(MSWin32):
..\gv.c(1462) : warning C4146: unary minus operator applied to unsigned type, result still unsigned
..\gv.c(1560) : warning C4146: unary minus operator applied to unsigned type, result still unsigned
..\gv.c(1624) : warning C4146: unary minus operator applied to unsigned type, result still unsigned
op.c(7358) : warning C4244: 'initializing' : conversion from 'U32' to 'const char', possible loss of data
..\pp.c(5897) : warning C4244: 'function' : conversion from 'U32' to 'const char', possible loss of data
..\regcomp.c(8651) : warning C4003: not enough actual parameters for macro 'Simple_vFAIL4'
..\regcomp.c(8651) : error C2059: syntax error : ','
..\regcomp.c(8680) : error C2143: syntax error : missing '{' before '*'
..\regcomp.c(8686) : error C2371: 'S_reg' : redefinition; different basic types
..\regcomp.c(8797) : warning C4003: not enough actual parameters for macro 'Simple_vFAIL4'
..\regcomp.c(8797) : error C2059: syntax error : ','
..\regcomp.c(8828) : warning C4133: 'return' : incompatible types - from 'regnode *' to 'int *'
..\regcomp.c(8882) : warning C4133: 'return' : incompatible types - from 'regnode *' to 'int *'
..\regcomp.c(8981) : warning C4133: 'return' : incompatible types - from 'regnode *' to 'int *'
..\regcomp.c(9016) : warning C4133: 'return' : incompatible types - from 'regnode *' to 'int *'
..\regcomp.c(9097) : warning C4133: 'return' : incompatible types - from 'regnode *' to 'int *'
..\regcomp.c(9107) : warning C4003: not enough actual parameters for macro 'Simple_vFAIL4'
..\regcomp.c(9107) : error C2059: syntax error : ','
..\regcomp.c(9161) : warning C4133: 'return' : incompatible types - from 'regnode *' to 'int *'
..\regcomp.c(9166) : warning C4133: 'return' : incompatible types - from 'regnode *' to 'int *'
..\regcomp.c(9309) : warning C4133: 'return' : incompatible types - from 'regnode *' to 'int *'
..\regcomp.c(9318) : warning C4133: 'return' : incompatible types - from 'regnode *' to 'int *'
..\regcomp.c(9573) : warning C4133: 'return' : incompatible types - from 'regnode *' to 'int *'
..\regcomp.c(9584) : error C2143: syntax error : missing '{' before '*'
..\regcomp.c(9586) : error C2371: 'S_regbranch' : redefinition; different basic types
..\regcomp.c(9649) : warning C4133: 'return' : incompatible types - from 'regnode *' to 'int *'
..\regcomp.c(11648) : warning C4003: not enough actual parameters for macro 'Simple_vFAIL4'
..\regcomp.c(11648) : error C2059: syntax error : ','
..\regcomp.c(12568) : warning C4003: not enough actual parameters for macro 'Simple_vFAIL4'
..\regcomp.c(12568) : error C2059: syntax error : ','
..\regcomp.c(12774) : warning C4003: not enough actual parameters for macro 'Simple_vFAIL4'
..\regcomp.c(12774) : error C2059: syntax error : ','
..\regcomp.c(13073) : warning C4003: not enough actual parameters for macro 'Simple_vFAIL4'
..\regcomp.c(13073) : error C2059: syntax error : ','
-- 
Report by Test::Smoke v1.53 build 1374 running on perl 5.10.0
(Reporter v0.050 / Smoker v0.045)




nntp.perl.org: Perl Programming lists via nntp and http.
Comments to Ask Bjørn Hansen at ask@perl.org | Group listing | About