develooper Front page | perl.perl5.porters | Postings from August 2013

Smoke [blead] v5.19.2-404-gea821e9 FAIL(F) MSWin32 Win2000 SP4 (x86/1 cpu) {blead}

From:
George Greer
Date:
August 13, 2013 00:06
Subject:
Smoke [blead] v5.19.2-404-gea821e9 FAIL(F) MSWin32 Win2000 SP4 (x86/1 cpu) {blead}
Message ID:
20130813000621.585FD4E04A1@zwei

Automated smoke report for 5.19.3 patch ea821e91c8f7dbc150567d8ae75f7aa0a0b80611 v5.19.2-404-gea821e9
perl-win2k: Intel(R) Core(TM) i7 CPU 920 @ 2.67GHz(~2662 MHz) (x86/1 cpu)
    on        MSWin32 - Win2000 SP4
    using     cl version 14.00.50727.762
    smoketime 9 hours 55 minutes (average 2 hours 28 minutes)

Summary: FAIL(F)

O = OK  F = Failure(s), extended report at the bottom
X = Failure(s) under TEST but not under harness
? = still running or test results not (yet) available
Build failures during:       - = unknown or N/A
c = Configure, m = make, M = make (after miniperl), t = make test-prep

v5.19.2-404-gea821e9  Configuration (common) none
----------- ---------------------------------------------------------
F F         
F F         -Duseithreads
| +--------- -DDEBUGGING
+----------- no debugging


Locally applied patches:
    SMOKEea821e91c8f7dbc150567d8ae75f7aa0a0b80611

Failures: (common-args) none
[default] 
[default] -DDEBUGGING
../t/re/pat.t...............................................FAILED
    228-231
../t/op/taint.t.............................................FAILED
    592
../ext/Devel-Peek/t/Peek.t..................................FAILED
    89
    Non-zero exit status: 1

[default] -Duseithreads
../t/re/pat.t...............................................FAILED
    228-231
../t/re/pat_thr.t...........................................FAILED
    228-231
../t/op/taint.t.............................................FAILED
    592
../dist/threads-shared/t/clone.t............................FAILED
    22, 25

[default] -DDEBUGGING -Duseithreads
../t/re/pat.t...............................................FAILED
    228-231
../t/re/pat_thr.t...........................................FAILED
    228-231
../t/op/taint.t.............................................FAILED
    592
../t/op/threads.t...........................................FAILED
    Non-zero exit status: 9
    Bad plan.  You planned 26 tests but ran 9.
../dist/threads-shared/t/clone.t............................FAILED
    22, 25
../dist/threads/t/free2.t...................................FAILED
    Non-zero exit status: 1
    Bad plan.  You planned 78 tests but ran 69.

Passed Todo tests: (common-args) none
[default] -Duseithreads
[default] -DDEBUGGING -Duseithreads
../cpan/List-Util/t/readonly.t..............................PASSED
    10

Compiler messages(MSWin32):
..\gv.c(1460) : warning C4146: unary minus operator applied to unsigned type, result still unsigned
..\gv.c(1558) : warning C4146: unary minus operator applied to unsigned type, result still unsigned
..\gv.c(1622) : warning C4146: unary minus operator applied to unsigned type, result still unsigned
..\mg.c(119) : warning C4244: '=' : conversion from 'U32' to 'char', possible loss of data
op.c(7360) : warning C4244: 'initializing' : conversion from 'U32' to 'const char', possible loss of data
..\pp.c(5889) : warning C4244: 'function' : conversion from 'U32' to 'const char', possible loss of data
..\toke.c(767) : warning C4244: '=' : conversion from 'U32' to 'U8', possible loss of data
..\toke.c(4722) : warning C4244: 'initializing' : conversion from 'unsigned short' to 'const char', possible loss of data
B.xs(1983) : warning C4018: '<=' : signed/unsigned mismatch
B.xs(1993) : warning C4018: '<=' : signed/unsigned mismatch
Base64.xs(394) : warning C4146: unary minus operator applied to unsigned type, result still unsigned
Base64.xs(396) : warning C4146: unary minus operator applied to unsigned type, result still unsigned
scalar.xs(203) : warning C4018: '>' : signed/unsigned mismatch
Storable.xs(4996) : warning C4101: 'mg' : unreferenced local variable
Storable.xs(5028) : warning C4101: 'mg' : unreferenced local variable
Piece.xs(950) : warning C4101: 'ret' : unreferenced local variable
Typemap.c(812) : warning C4101: 'RETVAL' : unreferenced local variable
-- 
Report by Test::Smoke v1.53 build 1374 running on perl 5.10.0
(Reporter v0.050 / Smoker v0.045)




nntp.perl.org: Perl Programming lists via nntp and http.
Comments to Ask Bjørn Hansen at ask@perl.org | Group listing | About