develooper Front page | perl.perl5.porters | Postings from August 2013

Smoke [blead] v5.19.2-403-gb59747a FAIL(F) linux 3.8.0-23-generic [debian] (x86_64/8 cpu) {blead_clang_quick}

From:
George Greer
Date:
August 12, 2013 10:13
Subject:
Smoke [blead] v5.19.2-403-gb59747a FAIL(F) linux 3.8.0-23-generic [debian] (x86_64/8 cpu) {blead_clang_quick}
Message ID:
201308121013.r7CADYRq005046@m-l.org
Smoke logs available at http://m-l.org/~perl/smoke/perl/linux/blead_clang_quick/logb59747acf7d9e3f69f93d8e6b2906805c2e3b690.log.gz

Automated smoke report for 5.19.3 patch b59747acf7d9e3f69f93d8e6b2906805c2e3b690 v5.19.2-403-gb59747a
zwei: Intel(R) Core(TM) i7 CPU 920 @ 2.67GHz (GenuineIntel 2668MHz) (x86_64/8 cpu)
    on        linux - 3.8.0-23-generic [debian]
    using     clang version 4.2.1 Compatible Clang 3.3 (trunk 177842)
    smoketime 47 minutes 56 seconds (average 11 minutes 59 seconds)

Summary: FAIL(F)

O = OK  F = Failure(s), extended report at the bottom
X = Failure(s) under TEST but not under harness
? = still running or test results not (yet) available
Build failures during:       - = unknown or N/A
c = Configure, m = make, M = make (after miniperl), t = make test-prep

v5.19.2-403-gb59747a  Configuration (common) -Accflags=-DPERL_POISON -Dcc=clang
----------- ---------------------------------------------------------
F F         
O O         -Duseithreads
| +--------- -DDEBUGGING
+----------- no debugging


Locally applied patches:
    SMOKEb59747acf7d9e3f69f93d8e6b2906805c2e3b690

Testsuite was run only with 'harness'

Failures: (common-args) -Accflags=-DPERL_POISON -Dcc=clang
[default] 
../ext/Devel-Peek/t/Peek.t..................................FAILED
    89
    Non-zero exit status: 1

[default] -DDEBUGGING
../cpan/Socket/t/getaddrinfo.t..............................FAILED
    22-23
    Non-zero exit status: 2
../ext/Devel-Peek/t/Peek.t..................................FAILED
    89
    Non-zero exit status: 1

Passed Todo tests: (common-args) -Accflags=-DPERL_POISON -Dcc=clang
[default] -Duseithreads
[default] -DDEBUGGING -Duseithreads
../cpan/List-Util/t/readonly.t..............................PASSED
    10

Compiler messages(gcc):
Storable.xs:4122:2: warning: null passed to a callee which requires a non-null argument [-Wnonnull]
Storable.xs:4319:3: warning: null passed to a callee which requires a non-null argument [-Wnonnull]
Storable.xs:5668:2: warning: null passed to a callee which requires a non-null argument [-Wnonnull]
Storable.xs:5731:2: warning: null passed to a callee which requires a non-null argument [-Wnonnull]
Collate.xs:616:2: warning: expression result unused [-Wunused-value]
Collate.xs:606:2: warning: expression result unused [-Wunused-value]
-- 
Report by Test::Smoke v1.53 build 1374 running on perl 5.14.2
(Reporter v0.050 / Smoker v0.045)




nntp.perl.org: Perl Programming lists via nntp and http.
Comments to Ask Bjørn Hansen at ask@perl.org | Group listing | About