develooper Front page | perl.perl5.porters | Postings from July 2013

Smoke [maint-5.18] v5.18.0-20-gcb41b60 FAIL(F) MSWin32 Win2000 SP4 (x86/1 cpu) {maint}

From:
George Greer
Date:
July 6, 2013 20:54
Subject:
Smoke [maint-5.18] v5.18.0-20-gcb41b60 FAIL(F) MSWin32 Win2000 SP4 (x86/1 cpu) {maint}
Message ID:
20130706205348.5609A4E03DF@zwei

Automated smoke report for 5.18.1 patch cb41b60eb85d07e84d6bbd2b8ba90ade4b12124a v5.18.0-20-gcb41b60
perl-win2k: Intel(R) Core(TM) i7 CPU 920 @ 2.67GHz(~2662 MHz) (x86/1 cpu)
    on        MSWin32 - Win2000 SP4
    using     cl version 14.00.50727.762
    smoketime 4 hours 34 minutes (average 1 hour 8 minutes)

Summary: FAIL(F)

O = OK  F = Failure(s), extended report at the bottom
X = Failure(s) under TEST but not under harness
? = still running or test results not (yet) available
Build failures during:       - = unknown or N/A
c = Configure, m = make, M = make (after miniperl), t = make test-prep

v5.18.0-20-gcb41b60  Configuration (common) none
----------- ---------------------------------------------------------
F F         
F F         -Duseithreads
| +--------- -DDEBUGGING
+----------- no debugging


Locally applied patches:
    SMOKEcb41b60eb85d07e84d6bbd2b8ba90ade4b12124a

Failures: (common-args) none
[default] 
[default] -Duseithreads
../t/porting/customized.t...................................FAILED
    11-12, 15
../t/porting/regen.t........................................FAILED
    8-11, 13-18, 20, 22, 24, 28, 31
../cpan/podlators/t/text-encoding.t.........................FAILED
    Non-zero exit status: 255
    Bad plan.  You planned 5 tests but ran 1.

[default] -DDEBUGGING
../t/porting/customized.t...................................FAILED
    3, 6-7
../t/porting/regen.t........................................FAILED
    8-11, 13-18, 20, 22, 24, 28, 31
../cpan/podlators/t/text-encoding.t.........................FAILED
    Non-zero exit status: 255
    Bad plan.  You planned 5 tests but ran 1.

[default] -DDEBUGGING -Duseithreads
../t/porting/customized.t...................................FAILED
    3-4, 7
../t/porting/regen.t........................................FAILED
    8-11, 13-18, 20, 22, 24, 28, 31
../cpan/podlators/t/text-encoding.t.........................FAILED
    Non-zero exit status: 255
    Bad plan.  You planned 5 tests but ran 1.

Compiler messages(MSWin32):
op.c(7377) : warning C4244: 'initializing' : conversion from 'U32' to 'const char', possible loss of data
..\pp.c(5883) : warning C4244: 'function' : conversion from 'U32' to 'const char', possible loss of data
..\toke.c(765) : warning C4244: '=' : conversion from 'U32' to 'U8', possible loss of data
..\util.c(2190) : warning C4244: '=' : conversion from 'long' to 'char', possible loss of data
..\util.c(2191) : warning C4244: '=' : conversion from 'long' to 'char', possible loss of data
..\util.c(2192) : warning C4244: '=' : conversion from 'long' to 'char', possible loss of data
..\util.c(2193) : warning C4244: '=' : conversion from 'long' to 'char', possible loss of data
..\util.c(2219) : warning C4244: '=' : conversion from 'long' to 'char', possible loss of data
..\util.c(2220) : warning C4244: '=' : conversion from 'long' to 'char', possible loss of data
..\util.c(2221) : warning C4244: '=' : conversion from 'long' to 'char', possible loss of data
..\util.c(2222) : warning C4244: '=' : conversion from 'long' to 'char', possible loss of data
B.xs(997) : warning C4101: 'len' : unreferenced local variable
B.xs(1942) : warning C4018: '<=' : signed/unsigned mismatch
B.xs(1952) : warning C4018: '<=' : signed/unsigned mismatch
Base64.xs(394) : warning C4146: unary minus operator applied to unsigned type, result still unsigned
Base64.xs(396) : warning C4146: unary minus operator applied to unsigned type, result still unsigned
POSIX.xs(707) : warning C4101: 'charstring' : unreferenced local variable
scalar.xs(203) : warning C4018: '>' : signed/unsigned mismatch
Storable.xs(4902) : warning C4101: 'mg' : unreferenced local variable
Storable.xs(4934) : warning C4101: 'mg' : unreferenced local variable
Piece.xs(950) : warning C4101: 'ret' : unreferenced local variable
Typemap.c(813) : warning C4101: 'RETVAL' : unreferenced local variable
-- 
Report by Test::Smoke v1.53 build 1374 running on perl 5.10.0
(Reporter v0.050 / Smoker v0.045)




nntp.perl.org: Perl Programming lists via nntp and http.
Comments to Ask Bjørn Hansen at ask@perl.org | Group listing | About