develooper Front page | perl.perl5.porters | Postings from July 2013

Smoke [maint-5.10] perl-5.10.1-6-ge94431a FAIL(F) linux 3.8.0-23-generic [debian] (x86_64/8 cpu) {maint_clang}

From:
George Greer
Date:
July 2, 2013 19:02
Subject:
Smoke [maint-5.10] perl-5.10.1-6-ge94431a FAIL(F) linux 3.8.0-23-generic [debian] (x86_64/8 cpu) {maint_clang}
Message ID:
201307021902.r62J2BNw005373@m-l.org
Smoke logs available at http://m-l.org/~perl/smoke/perl/linux/maint_clang/loge94431af0ada74486afd65207f3e0345fe7485fe.log.gz

Automated smoke report for 5.10.1 patch e94431af0ada74486afd65207f3e0345fe7485fe perl-5.10.1-6-ge94431a
zwei: Intel(R) Core(TM) i7 CPU 920 @ 2.67GHz (GenuineIntel 2668MHz) (x86_64/8 cpu)
    on        linux - 3.8.0-23-generic [debian]
    using     clang version 4.2.1 Compatible Clang 3.3 (trunk 177842)
    smoketime 18 hours 36 minutes (average 55 minutes 49 seconds)

Summary: FAIL(F)

O = OK  F = Failure(s), extended report at the bottom
X = Failure(s) under TEST but not under harness
? = still running or test results not (yet) available
Build failures during:       - = unknown or N/A
c = Configure, m = make, M = make (after miniperl), t = make test-prep

perl-5.10.1-6-ge94431a  Configuration (common) -Dcc=clang
----------- ---------------------------------------------------------
F F F F F F 
F F F F F F -Accflags=-DPERL_POISON
F F F F F F -Duse64bitall -Accflags=-DPERL_GLOBAL_STRUCT
F F F F F F -Dusemorebits -Accflags=-DPERL_GLOBAL_STRUCT_PRIVATE
F F F F F F -Dmad
F F F F F F -Duseithreads
F F F F F F -Duseithreads -Accflags=-DPERL_POISON
F F F F F F -Duseithreads -Duse64bitall -Accflags=-DPERL_GLOBAL_STRUCT
F F F F F F -Duseithreads -Dusemorebits -Accflags=-DPERL_GLOBAL_STRUCT_PRIVATE
F F F F F F -Duseithreads -Dmad
| | | | | +- LC_ALL = en_US.utf8 -DDEBUGGING
| | | | +--- PERLIO = perlio -DDEBUGGING
| | | +----- PERLIO = stdio  -DDEBUGGING
| | +------- LC_ALL = en_US.utf8
| +--------- PERLIO = perlio
+----------- PERLIO = stdio 

Locally applied patches:
    SMOKEe94431af0ada74486afd65207f3e0345fe7485fe

Failures: (common-args) -Dcc=clang
[stdio/perlio] 
[stdio/perlio/en_US.utf8] -DDEBUGGING
[stdio/perlio/en_US.utf8] -Accflags=-DPERL_POISON
[stdio/perlio/en_US.utf8] -DDEBUGGING -Accflags=-DPERL_POISON
[perlio/en_US.utf8] -Duse64bitall -Accflags=-DPERL_GLOBAL_STRUCT
[stdio/perlio/en_US.utf8] -DDEBUGGING -Duse64bitall -Accflags=-DPERL_GLOBAL_STRUCT
[stdio/en_US.utf8] -Dusemorebits -Accflags=-DPERL_GLOBAL_STRUCT_PRIVATE
[stdio/perlio/en_US.utf8] -DDEBUGGING -Dusemorebits -Accflags=-DPERL_GLOBAL_STRUCT_PRIVATE
[stdio/perlio/en_US.utf8] -Dmad
[stdio/perlio] -DDEBUGGING -Dmad
    ../ext/ODBM_File/t/odbm.t...................................FAILED
        Non-zero exit status: 127
        No plan found in TAP output
    ../lib/DBM_Filter/t/01error.t...............................FAILED
        Non-zero exit status: 127
        Bad plan.  You planned 21 tests but ran 3.
    ../lib/Memoize/t/errors.t...................................FAILED
        Bad plan.  You planned 11 tests but ran 6.

[en_US.utf8] 
[stdio] -Duse64bitall -Accflags=-DPERL_GLOBAL_STRUCT
[perlio] -Dusemorebits -Accflags=-DPERL_GLOBAL_STRUCT_PRIVATE
    ../lib/DBM_Filter/t/01error.t...............................FAILED
        Non-zero exit status: 127
        Bad plan.  You planned 21 tests but ran 3.
    ../ext/ODBM_File/t/odbm.t...................................FAILED
        Non-zero exit status: 127
        No plan found in TAP output
    ../lib/Memoize/t/errors.t...................................FAILED
        Bad plan.  You planned 11 tests but ran 6.

[en_US.utf8] -DDEBUGGING -Dmad
    ../ext/ODBM_File/t/odbm.t...................................FAILED
        Non-zero exit status: 127
        No plan found in TAP output
    ../lib/DBM_Filter/t/01error.t...............................FAILED
        Non-zero exit status: 127
        Bad plan.  You planned 21 tests but ran 3.
    ../t/op/runlevel.t..........................................FAILED
        9
    ../lib/Memoize/t/errors.t...................................FAILED
        Bad plan.  You planned 11 tests but ran 6.
    ../lib/warnings.t...........................................FAILED
        238

[stdio/perlio/en_US.utf8] -Duseithreads
[stdio/perlio] -DDEBUGGING -Duseithreads
[stdio/perlio/en_US.utf8] -Duseithreads -Accflags=-DPERL_POISON
[stdio/perlio/en_US.utf8] -DDEBUGGING -Duseithreads -Accflags=-DPERL_POISON
[stdio/perlio/en_US.utf8] -Duseithreads -Duse64bitall -Accflags=-DPERL_GLOBAL_STRUCT
[stdio/en_US.utf8] -DDEBUGGING -Duseithreads -Duse64bitall -Accflags=-DPERL_GLOBAL_STRUCT
[en_US.utf8] -Duseithreads -Dusemorebits -Accflags=-DPERL_GLOBAL_STRUCT_PRIVATE
[stdio/perlio/en_US.utf8] -DDEBUGGING -Duseithreads -Dusemorebits -Accflags=-DPERL_GLOBAL_STRUCT_PRIVATE
[en_US.utf8] -Duseithreads -Dmad
[stdio/perlio] -DDEBUGGING -Duseithreads -Dmad
    ../ext/ODBM_File/t/odbm.t...................................FAILED
        Non-zero exit status: 127
        No plan found in TAP output
    ../lib/DBM_Filter/t/01error.t...............................FAILED
        Non-zero exit status: 127
        Bad plan.  You planned 21 tests but ran 3.
    ../lib/Memoize/t/errors.t...................................FAILED
        Non-zero exit status: 127
        Bad plan.  You planned 11 tests but ran 6.

[en_US.utf8] -DDEBUGGING -Duseithreads
[perlio] -DDEBUGGING -Duseithreads -Duse64bitall -Accflags=-DPERL_GLOBAL_STRUCT
[perlio] -Duseithreads -Dusemorebits -Accflags=-DPERL_GLOBAL_STRUCT_PRIVATE
[stdio/perlio] -Duseithreads -Dmad
[en_US.utf8] -DDEBUGGING -Duseithreads -Dmad
    ../ext/ODBM_File/t/odbm.t...................................FAILED
        Non-zero exit status: 127
        No plan found in TAP output
    ../lib/Memoize/t/errors.t...................................FAILED
        Non-zero exit status: 127
        Bad plan.  You planned 11 tests but ran 6.
    ../lib/DBM_Filter/t/01error.t...............................FAILED
        Non-zero exit status: 127
        Bad plan.  You planned 21 tests but ran 3.

[stdio] -Duseithreads -Dusemorebits -Accflags=-DPERL_GLOBAL_STRUCT_PRIVATE
    ../ext/ODBM_File/t/odbm.t...................................FAILED
        Non-zero exit status: 127
        No plan found in TAP output
    ../lib/DBM_Filter/t/01error.t...............................FAILED
        Non-zero exit status: 127
        Bad plan.  You planned 21 tests but ran 3.
    ../lib/Memoize/t/errors.t...................................FAILED
        Non-zero exit status: 127
        Bad plan.  You planned 11 tests but ran 6.
Inconsistent test results (between TEST and harness):
    ../lib/Thread/Semaphore/t/01_basic.t....FAILED--non-zero wait status: 139

Compiler messages(gcc):
regcomp.c:6749:41: warning: address of stack memory associated with local variable 'len' returned [-Wreturn-stack-address]
dump.c:414:57: warning: comparison of constant 85 with expression of type 'svtype' is always false [-Wtautological-constant-out-of-range-compare]
hv.c:362:20: warning: comparison of constant 255 with expression of type 'svtype' is always false [-Wtautological-constant-out-of-range-compare]
hv.c:822:14: warning: comparison of integers of different signs: 'IV' (aka 'long') and 'STRLEN' (aka 'unsigned long') [-Wsign-compare]
hv.c:2495:14: warning: comparison of integers of different signs: 'IV' (aka 'long') and 'STRLEN' (aka 'unsigned long') [-Wsign-compare]
sv.c:437:21: warning: comparison of constant 255 with expression of type 'svtype' is always true [-Wtautological-constant-out-of-range-compare]
sv.c:7714:21: warning: comparison of constant 255 with expression of type 'svtype' is always false [-Wtautological-constant-out-of-range-compare]
perlio.c:5325:21: warning: comparison of integers of different signs: 'size_t' (aka 'unsigned long') and 'int' [-Wsign-compare]
Dumper.xs:813:41: warning: format specifies type 'long' but the argument has type 'U32' (aka 'unsigned int') [-Wformat]
Call.xs:63:11: warning: format specifies type 'int' but the argument has type 'STRLEN' (aka 'unsigned long') [-Wformat]
Call.xs:63:31: warning: format specifies type 'int' but the argument has type 'STRLEN' (aka 'unsigned long') [-Wformat]
Call.xs:100:13: warning: format specifies type 'int' but the argument has type 'STRLEN' (aka 'unsigned long') [-Wformat]
Call.xs:156:11: warning: format specifies type 'int' but the argument has type 'STRLEN' (aka 'unsigned long') [-Wformat]
Call.xs:175:14: warning: format specifies type 'int' but the argument has type 'STRLEN' (aka 'unsigned long') [-Wformat]
FieldHash.xs:128:20: warning: using the result of an assignment as a condition without parentheses [-Wparentheses]
FieldHash.xs:165:13: warning: using the result of an assignment as a condition without parentheses [-Wparentheses]
FieldHash.xs:216:26: warning: using the result of an assignment as a condition without parentheses [-Wparentheses]
FieldHash.xs:285:16: warning: using the result of an assignment as a condition without parentheses [-Wparentheses]
FieldHash.xs:293:17: warning: using the result of an assignment as a condition without parentheses [-Wparentheses]
FieldHash.xs:310:15: warning: using the result of an assignment as a condition without parentheses [-Wparentheses]
FieldHash.xs:438:24: warning: using the result of an assignment as a condition without parentheses [-Wparentheses]
Socket.xs:268:9: warning: format specifies type 'int' but the argument has type 'STRLEN' (aka 'unsigned long') [-Wformat]
Socket.xs:268:18: warning: format specifies type 'int' but the argument has type 'unsigned long' [-Wformat]
Socket.xs:292:39: warning: format specifies type 'int' but the argument has type 'STRLEN' (aka 'unsigned long') [-Wformat]
Socket.xs:293:5: warning: format specifies type 'int' but the argument has type 'unsigned long' [-Wformat]
Socket.xs:408:9: warning: format specifies type 'int' but the argument has type 'STRLEN' (aka 'unsigned long') [-Wformat]
Socket.xs:408:18: warning: format specifies type 'int' but the argument has type 'unsigned long' [-Wformat]
Socket.xs:429:4: warning: format specifies type 'int' but the argument has type 'STRLEN' (aka 'unsigned long') [-Wformat]
Socket.xs:429:17: warning: format specifies type 'int' but the argument has type 'unsigned long' [-Wformat]
Storable.xs:4139:2: warning: null passed to a callee which requires a non-null argument [-Wnonnull]
Storable.xs:5531:2: warning: null passed to a callee which requires a non-null argument [-Wnonnull]
Storable.xs:5593:2: warning: null passed to a callee which requires a non-null argument [-Wnonnull]
Normalize.xs:383:19: warning: '&&' within '||' [-Wlogical-op-parentheses]
Normalize.xs:384:15: warning: '&&' within '||' [-Wlogical-op-parentheses]
re_comp.c:6749:41: warning: address of stack memory associated with local variable 'len' returned [-Wreturn-stack-address]
sv.c:456:20: warning: comparison of constant 255 with expression of type 'svtype' is always true [-Wtautological-constant-out-of-range-compare]
sv.c:5400:23: warning: comparison of constant 255 with expression of type 'svtype' is always true [-Wtautological-constant-out-of-range-compare]
pad.c:134:26: warning: unused parameter 's' [-Wunused-parameter]
dump.c:2364:57: warning: comparison of constant 85 with expression of type 'svtype' is always false [-Wtautological-constant-out-of-range-compare]
sv.c:10539:22: warning: comparison of constant 255 with expression of type 'svtype' is always false [-Wtautological-constant-out-of-range-compare]
-- 
Report by Test::Smoke v1.53 build 1374 running on perl 5.14.2
(Reporter v0.050 / Smoker v0.045)




nntp.perl.org: Perl Programming lists via nntp and http.
Comments to Ask Bjørn Hansen at ask@perl.org | Group listing | About