develooper Front page | perl.perl5.porters | Postings from June 2013

Smoke [blead] v5.19.0-601-g14fd935 FAIL(XM) linux 3.8.0-23-generic [debian] (x86_64/8 cpu) {blead_g++}

From:
George Greer
Date:
June 20, 2013 21:55
Subject:
Smoke [blead] v5.19.0-601-g14fd935 FAIL(XM) linux 3.8.0-23-generic [debian] (x86_64/8 cpu) {blead_g++}
Message ID:
201306202155.r5KLtQJY008286@m-l.org
Smoke logs available at http://m-l.org/~perl/smoke/perl/linux/blead_g++/log14fd9356c9a6abaf104daad94dfc9ff5234938a6.log.gz

Automated smoke report for 5.19.1 patch 14fd9356c9a6abaf104daad94dfc9ff5234938a6 v5.19.0-601-g14fd935
zwei: Intel(R) Core(TM) i7 CPU 920 @ 2.67GHz (GenuineIntel 2668MHz) (x86_64/8 cpu)
    on        linux - 3.8.0-23-generic [debian]
    using     g++ version 4.7.3
    smoketime 1 day 5 hours 32 minutes (average 1 hour 13 minutes)

Summary: FAIL(XM)

O = OK  F = Failure(s), extended report at the bottom
X = Failure(s) under TEST but not under harness
? = still running or test results not (yet) available
Build failures during:       - = unknown or N/A
c = Configure, m = make, M = make (after miniperl), t = make test-prep

v5.19.0-601-g14fd935  Configuration (common) -Dcc=g++ -O
----------- ---------------------------------------------------------
O O O O O O 
O O O O O X -Accflags=-DPERL_POISON
O O O O O O -Duse64bitall
O O X O O O -Dusemorebits -Accflags=-DPERL_GLOBAL_STRUCT
O O O O O O -Dmad
O O O M - - -Accflags=-DPERL_NO_COW
O O O O O O -Duseithreads
O O X O O O -Duseithreads -Accflags=-DPERL_POISON
O O O O O O -Duseithreads -Duse64bitall
O X O O O O -Duseithreads -Dusemorebits -Accflags=-DPERL_GLOBAL_STRUCT
O O O O O X -Duseithreads -Dmad
O O O O O X -Duseithreads -Accflags=-DPERL_NO_COW
| | | | | +- LC_ALL = en_US.utf8 -DDEBUGGING
| | | | +--- PERLIO = perlio -DDEBUGGING
| | | +----- PERLIO = stdio  -DDEBUGGING
| | +------- LC_ALL = en_US.utf8
| +--------- PERLIO = perlio
+----------- PERLIO = stdio 

Locally applied patches:
    SMOKE14fd9356c9a6abaf104daad94dfc9ff5234938a6

Failures: (common-args) -Dcc=g++ -O
[en_US.utf8] -DDEBUGGING -Accflags=-DPERL_POISON
[en_US.utf8] -Duseithreads -Accflags=-DPERL_POISON
[en_US.utf8] -DDEBUGGING -Duseithreads -Dmad
Inconsistent test results (between TEST and harness):
    ../lib/Benchmark.t...................... ................................................ FAILED at test 7

[en_US.utf8] -Dusemorebits -Accflags=-DPERL_GLOBAL_STRUCT
Inconsistent test results (between TEST and harness):
    ../t/cpan/Module-Build/t/compat.t....... ................................... FAILED at test 33

[minitest] -DDEBUGGING -Accflags=-DPERL_NO_COW
    t/comp/hints ................... FAILED--expected 31 tests, saw 10
    t/comp/require ................. FAILED at test 52
    t/run/fresh_perl ............... FAILED at test 81
    t/run/switchM .................. FAILED at test 1
    t/run/switches ................. FAILED--no leader found
    t/io/crlf ...................... FAILED--expected 16416 tests, saw 16
    t/io/open ...................... FAILED--no leader found
    t/io/utf8 ...................... FAILED--expected 61 tests, saw 52
    t/re/charset ................... FAILED--no leader found
    t/re/overload .................. FAILED at test 34
    t/re/pat ....................... FAILED--no leader found
    t/re/pat_special_cc ............ FAILED--expected 9 tests, saw 3
    t/re/reg_mesg .................. FAILED at test 153
    t/re/regex_sets ................ FAILED--no leader found
    t/re/regex_sets_compat ......... FAILED at test 149
    t/re/regexp .................... FAILED at test 122
    t/re/regexp_noamp .............. FAILED at test 122
    t/re/regexp_notrie ............. FAILED at test 122
    t/re/regexp_qr ................. FAILED at test 122
    t/re/regexp_qr_embed ........... FAILED at test 122
    t/re/regexp_trielist ........... FAILED at test 122
    t/re/rxcode .................... FAILED--no leader found
    t/re/uniprops .................. FAILED--no leader found
    t/opbasic/qq ................... FAILED at test 28
    t/op/blocks .................... FAILED--no leader found
    t/op/closure ................... FAILED--no leader found
    t/op/coreamp ................... FAILED--no leader found
    t/op/die ....................... FAILED at test 18
    t/op/eval ...................... FAILED at test 124
    t/op/filetest .................. FAILED--expected 431 tests, saw 33
    t/op/fresh_perl_utf8 ........... FAILED at test 1
    t/op/gv ........................ FAILED--no leader found
    t/op/hash ...................... FAILED--no leader found
    t/op/index ..................... FAILED--no leader found
    t/op/lc ........................ FAILED--no leader found
    t/op/method .................... FAILED--no leader found
    t/op/my_stash .................. FAILED--no leader found
    t/op/override .................. FAILED at test 28
    t/op/pack ...................... FAILED--no leader found
    t/op/push ...................... FAILED--no leader found
    t/op/ref ....................... FAILED--expected 230 tests, saw 137
    t/op/smartkve .................. FAILED--no leader found
    t/op/split ..................... FAILED--no leader found
    t/op/substr .................... FAILED--no leader found
    t/op/tie ....................... FAILED at test 2
    t/op/tie_fetch_count ........... FAILED--expected 312 tests, saw 0
    t/op/tiehandle ................. FAILED--no leader found
    t/op/tr ........................ FAILED--no leader found
    t/op/universal ................. FAILED--no leader found
    t/op/utf8cache ................. FAILED--no leader found
    t/op/utfhash ................... FAILED--expected 99 tests, saw 39
    t/op/utftaint .................. FAILED--no leader found
    t/uni/bless .................... FAILED--no leader found
    t/uni/cache .................... FAILED--no leader found
    t/uni/caller ................... FAILED--expected 18 tests, saw 0
    t/uni/class .................... FAILED--no leader found
    t/uni/fold ..................... FAILED--no leader found
    t/uni/goto ..................... FAILED--no leader found
    t/uni/gv ....................... FAILED--no leader found
    t/uni/labels ................... FAILED--no leader found
    t/uni/lower .................... FAILED--no leader found
    t/uni/method ................... FAILED--no leader found
    t/uni/opcroak .................. FAILED at test 1
    t/uni/package .................. FAILED--no leader found
    t/uni/parser ................... FAILED--no leader found
    t/uni/readline ................. FAILED--no leader found
    t/uni/select ................... FAILED--no leader found
    t/uni/stash .................... FAILED--no leader found
    t/uni/title .................... FAILED--no leader found
    t/uni/universal ................ FAILED--no leader found
    t/uni/upper .................... FAILED--no leader found
    t/uni/variables ................ FAILED--no leader found
    t/uni/write .................... FAILED--expected 8 tests, saw 6

[perlio] -Duseithreads -Dusemorebits -Accflags=-DPERL_GLOBAL_STRUCT
Inconsistent test results (between TEST and harness):
    ../t/cpan/Module-Build/t/compat.t....... ................................... FAILED at test 46

[en_US.utf8] -DDEBUGGING -Duseithreads -Accflags=-DPERL_NO_COW
Inconsistent test results (between TEST and harness):
    ../t/cpan/Time-HiRes/t/alarm.t.......... ...................................... FAILED at test 2

Compiler messages(gcc):
try.c: In function ‘int main()’:
util.c: In function ‘void Perl_croak_no_mem()’:
util.c:1613:36: warning: ignoring return value of ‘ssize_t write(int, const void*, size_t)’, declared with attribute warn_unused_result [-Wunused-result]
mg.c: In function ‘int Perl_magic_set(SV*, MAGIC*)’:
mg.c:2774:36: warning: ignoring return value of ‘int setreuid(__uid_t, __uid_t)’, declared with attribute warn_unused_result [-Wunused-result]
mg.c:2803:25: warning: ignoring return value of ‘int seteuid(__uid_t)’, declared with attribute warn_unused_result [-Wunused-result]
mg.c:2833:36: warning: ignoring return value of ‘int setregid(__gid_t, __gid_t)’, declared with attribute warn_unused_result [-Wunused-result]
mg.c:2893:25: warning: ignoring return value of ‘int setegid(__gid_t)’, declared with attribute warn_unused_result [-Wunused-result]
pp_hot.c: In function ‘OP* Perl_pp_aassign()’:
pp_hot.c:1185:18: warning: ignoring return value of ‘int setresuid(__uid_t, __uid_t, __uid_t)’, declared with attribute warn_unused_result [-Wunused-result]
pp_hot.c:1217:18: warning: ignoring return value of ‘int setresgid(__gid_t, __gid_t, __gid_t)’, declared with attribute warn_unused_result [-Wunused-result]
sv.c: In function ‘void Perl_sv_vcatpvfn_flags(SV*, const char*, STRLEN, __va_list_tag (*)[1], SV**, I32, bool*, U32)’:
sv.c:10364:41: warning: ignoring return value of ‘char* gcvt(double, int, char*)’, declared with attribute warn_unused_result [-Wunused-result]
sv.c:11222:53: warning: ignoring return value of ‘char* gcvt(double, int, char*)’, declared with attribute warn_unused_result [-Wunused-result]
sv.c: In function ‘char* Perl_sv_2pv_flags(SV*, STRLEN*, I32)’:
sv.c:2932:50: warning: ignoring return value of ‘char* gcvt(double, int, char*)’, declared with attribute warn_unused_result [-Wunused-result]
sv.c:2937:50: warning: ignoring return value of ‘char* gcvt(double, int, char*)’, declared with attribute warn_unused_result [-Wunused-result]
doio.c: In function ‘void S_exec_failed(const char*, int, int)’:
doio.c:1399:43: warning: ignoring return value of ‘ssize_t write(int, const void*, size_t)’, declared with attribute warn_unused_result [-Wunused-result]
doio.c: In function ‘PerlIOl** Perl_nextargv(GV*)’:
doio.c:876:46: warning: ignoring return value of ‘int fchown(int, __uid_t, __gid_t)’, declared with attribute warn_unused_result [-Wunused-result]
perlio.c: In function ‘void PerlIO_debug(const char*, ...)’:
perlio.c:484:43: warning: ignoring return value of ‘ssize_t write(int, const void*, size_t)’, declared with attribute warn_unused_result [-Wunused-result]
op.c: In function ‘OP* S_fold_constants(OP*)’:
op.c:3232:1: warning: argument ‘o’ might be clobbered by ‘longjmp’ or ‘vfork’ [-Wclobbered]
sdbm.c: In function ‘int makroom(DBM*, long int, int)’:
sdbm.c:378:70: warning: ignoring return value of ‘ssize_t write(int, const void*, size_t)’, declared with attribute warn_unused_result [-Wunused-result]
mg.c: In function ‘int Perl_magic_set(PerlInterpreter*, SV*, MAGIC*)’:
pp_hot.c: In function ‘OP* Perl_pp_aassign(PerlInterpreter*)’:
sv.c: In function ‘void Perl_sv_vcatpvfn_flags(PerlInterpreter*, SV*, const char*, STRLEN, __va_list_tag (*)[1], SV**, I32, bool*, U32)’:
sv.c:11222:53: warning: ignoring return value of ‘char* qgcvt(long double, int, char*)’, declared with attribute warn_unused_result [-Wunused-result]
sv.c: In function ‘char* Perl_sv_2pv_flags(PerlInterpreter*, SV*, STRLEN*, I32)’:
sv.c:2932:50: warning: ignoring return value of ‘char* qgcvt(long double, int, char*)’, declared with attribute warn_unused_result [-Wunused-result]
sv.c:2937:50: warning: ignoring return value of ‘char* qgcvt(long double, int, char*)’, declared with attribute warn_unused_result [-Wunused-result]
doio.c: In function ‘void S_exec_failed(PerlInterpreter*, const char*, int, int)’:
doio.c: In function ‘PerlIOl** Perl_nextargv(PerlInterpreter*, GV*)’:
op.c: In function ‘OP* S_fold_constants(PerlInterpreter*, OP*)’:
toke.c: In function ‘int Perl_yylex()’:
toke.c:8506:21: warning: variable ‘format_name’ set but not used [-Wunused-but-set-variable]
sv.c: In function ‘DIR* Perl_dirp_dup(PerlInterpreter*, DIR*, CLONE_PARAMS*)’:
sv.c:11668:26: warning: ignoring return value of ‘int fchdir(int)’, declared with attribute warn_unused_result [-Wunused-result]
perlio.c:475:56: warning: ignoring return value of ‘ssize_t write(int, const void*, size_t)’, declared with attribute warn_unused_result [-Wunused-result]
perl.c: In function ‘void S_init_tls_and_interp(PerlInterpreter*)’:
perl.c:99:2: warning: ignoring return value of ‘ssize_t write(int, const void*, size_t)’, declared with attribute warn_unused_result [-Wunused-result]
shared.xs: In function ‘user_lock* S_get_userlock(PerlInterpreter*, SV*, bool)’:
shared.xs:362:5: warning: deprecated conversion from string constant to ‘char*’ [-Wwrite-strings]
shared.xs: In function ‘void S_sharedsv_dec(PerlInterpreter*, SV*)’:
shared.xs:535:5: warning: deprecated conversion from string constant to ‘char*’ [-Wwrite-strings]
shared.xs: In function ‘void Perl_sharedsv_share(PerlInterpreter*, SV*)’:
shared.xs:564:9: warning: deprecated conversion from string constant to ‘char*’ [-Wwrite-strings]
shared.xs: In function ‘int sharedsv_scalar_mg_get(PerlInterpreter*, SV*, MAGIC*)’:
shared.xs:739:5: warning: deprecated conversion from string constant to ‘char*’ [-Wwrite-strings]
shared.xs: In function ‘int sharedsv_scalar_mg_set(PerlInterpreter*, SV*, MAGIC*)’:
shared.xs:817:5: warning: deprecated conversion from string constant to ‘char*’ [-Wwrite-strings]
shared.xs: In function ‘int sharedsv_scalar_mg_free(PerlInterpreter*, SV*, MAGIC*)’:
shared.xs:835:5: warning: deprecated conversion from string constant to ‘char*’ [-Wwrite-strings]
shared.xs: In function ‘int sharedsv_scalar_mg_local(PerlInterpreter*, SV*, MAGIC*)’:
shared.xs:868:9: warning: deprecated conversion from string constant to ‘char*’ [-Wwrite-strings]
shared.xs: In function ‘int sharedsv_elem_mg_FETCH(PerlInterpreter*, SV*, MAGIC*)’:
shared.xs:905:5: warning: deprecated conversion from string constant to ‘char*’ [-Wwrite-strings]
shared.xs: In function ‘int sharedsv_elem_mg_STORE(PerlInterpreter*, SV*, MAGIC*)’:
shared.xs:960:5: warning: deprecated conversion from string constant to ‘char*’ [-Wwrite-strings]
shared.xs: In function ‘int sharedsv_elem_mg_DELETE(PerlInterpreter*, SV*, MAGIC*)’:
shared.xs:1003:5: warning: deprecated conversion from string constant to ‘char*’ [-Wwrite-strings]
shared.xs: In function ‘U32 sharedsv_array_mg_FETCHSIZE(PerlInterpreter*, SV*, MAGIC*)’:
shared.xs:1066:5: warning: deprecated conversion from string constant to ‘char*’ [-Wwrite-strings]
shared.xs: In function ‘int sharedsv_array_mg_CLEAR(PerlInterpreter*, SV*, MAGIC*)’:
shared.xs:1086:5: warning: deprecated conversion from string constant to ‘char*’ [-Wwrite-strings]
shared.xs: In function ‘void Perl_sharedsv_lock(PerlInterpreter*, SV*)’:
shared.xs:1190:63: warning: deprecated conversion from string constant to ‘char*’ [-Wwrite-strings]
shared.xs: In function ‘void XS_threads__shared__tie_PUSH(PerlInterpreter*, CV*)’:
shared.xs:1287:13: warning: deprecated conversion from string constant to ‘char*’ [-Wwrite-strings]
shared.xs: In function ‘void XS_threads__shared__tie_UNSHIFT(PerlInterpreter*, CV*)’:
shared.xs:1305:9: warning: deprecated conversion from string constant to ‘char*’ [-Wwrite-strings]
shared.xs: In function ‘void XS_threads__shared__tie_POP(PerlInterpreter*, CV*)’:
shared.xs:1330:9: warning: deprecated conversion from string constant to ‘char*’ [-Wwrite-strings]
shared.xs: In function ‘void XS_threads__shared__tie_SHIFT(PerlInterpreter*, CV*)’:
shared.xs:1347:9: warning: deprecated conversion from string constant to ‘char*’ [-Wwrite-strings]
shared.xs: In function ‘void XS_threads__shared__tie_EXTEND(PerlInterpreter*, CV*)’:
shared.xs:1363:9: warning: deprecated conversion from string constant to ‘char*’ [-Wwrite-strings]
shared.xs: In function ‘void XS_threads__shared__tie_STORESIZE(PerlInterpreter*, CV*)’:
shared.xs:1373:9: warning: deprecated conversion from string constant to ‘char*’ [-Wwrite-strings]
shared.xs: In function ‘void XS_threads__shared__tie_EXISTS(PerlInterpreter*, CV*)’:
shared.xs:1385:13: warning: deprecated conversion from string constant to ‘char*’ [-Wwrite-strings]
shared.xs:1395:13: warning: deprecated conversion from string constant to ‘char*’ [-Wwrite-strings]
shared.xs: In function ‘void XS_threads__shared__tie_FIRSTKEY(PerlInterpreter*, CV*)’:
shared.xs:1411:9: warning: deprecated conversion from string constant to ‘char*’ [-Wwrite-strings]
shared.xs: In function ‘void XS_threads__shared__tie_NEXTKEY(PerlInterpreter*, CV*)’:
shared.xs:1439:9: warning: deprecated conversion from string constant to ‘char*’ [-Wwrite-strings]
shared.xs: In function ‘void XS_threads__shared_bless(PerlInterpreter*, CV*)’:
shared.xs:1699:13: warning: deprecated conversion from string constant to ‘char*’ [-Wwrite-strings]
threads.xs: In function ‘ithread* S_ithread_create(PerlInterpreter*, SV*, IV, int, int, int, int)’:
threads.xs:714:83: warning: ignoring return value of ‘ssize_t write(int, const void*, size_t)’, declared with attribute warn_unused_result [-Wunused-result]
toke.c: In function ‘int Perl_yylex(PerlInterpreter*)’:
-- 
Report by Test::Smoke v1.53 build 1374 running on perl 5.14.2
(Reporter v0.050 / Smoker v0.045)




nntp.perl.org: Perl Programming lists via nntp and http.
Comments to Ask Bjørn Hansen at ask@perl.org | Group listing | About