develooper Front page | perl.perl5.porters | Postings from May 2013

Smoke [blead] v5.17.11-29-g8b3945e FAIL(Xc) linux 3.5.0-24-generic [debian] (x86_64/8 cpu) {blead_clang_quick_sanitize=address}

From:
George Greer
Date:
May 2, 2013 03:28
Subject:
Smoke [blead] v5.17.11-29-g8b3945e FAIL(Xc) linux 3.5.0-24-generic [debian] (x86_64/8 cpu) {blead_clang_quick_sanitize=address}
Message ID:
201305020327.r423Rp0k004605@m-l.org
Smoke logs available at http://m-l.org/~perl/smoke/perl/linux/blead_clang_quick_sanitize=address/log8b3945e7b7b7ae6fd2369864ebe169bd9a91cf4e.log.gz

Automated smoke report for 5.17.12 patch 8b3945e7b7b7ae6fd2369864ebe169bd9a91cf4e v5.17.11-29-g8b3945e
zwei: Intel(R) Core(TM) i7 CPU 920 @ 2.67GHz (GenuineIntel 2668MHz) (x86_64/8 cpu)
    on        linux - 3.5.0-24-generic [debian]
    using     clang version 4.2.1 Compatible Clang 3.3 (trunk 177842)
    smoketime 4 days 20 hours 36 minutes (average 4 hours 51 minutes)

Summary: FAIL(Xc)

O = OK  F = Failure(s), extended report at the bottom
X = Failure(s) under TEST but not under harness
? = still running or test results not (yet) available
Build failures during:       - = unknown or N/A
c = Configure, m = make, M = make (after miniperl), t = make test-prep

v5.17.11-29-g8b3945e  Configuration (common) -Accflags="-fsanitize=address" -Aldflags="-fsanitize=address" -Dcc=clang -Doptimize="-O1"
----------- ---------------------------------------------------------
O O O O O O 
O O O O O O -Accflags=-DPERL_POISON
O O O O O O -Duse64bitall -Accflags=-DPERL_GLOBAL_STRUCT
O O O O O O -Dusemorebits -Accflags=-DPERL_GLOBAL_STRUCT_PRIVATE
O O O O O O -Dmad
O O O O O O -Accflags=-DPERL_NEW_COPY_ON_WRITE
O O O O O O -Duseithreads
O O O O O O -Duseithreads -Accflags=-DPERL_POISON
X X X c - - -Duseithreads -Duse64bitall -Accflags=-DPERL_GLOBAL_STRUCT
c - - c - - -Duseithreads -Dusemorebits -Accflags=-DPERL_GLOBAL_STRUCT_PRIVATE
c - - c - - -Duseithreads -Dmad
c - - c - - -Duseithreads -Accflags=-DPERL_NEW_COPY_ON_WRITE
| | | | | +- LC_ALL = en_US.utf8 -DDEBUGGING
| | | | +--- PERLIO = perlio -DDEBUGGING
| | | +----- PERLIO = stdio  -DDEBUGGING
| | +------- LC_ALL = en_US.utf8
| +--------- PERLIO = perlio
+----------- PERLIO = stdio 

Locally applied patches:
    SMOKE8b3945e7b7b7ae6fd2369864ebe169bd9a91cf4e

Failures: (common-args) -Accflags="-fsanitize=address" -Aldflags="-fsanitize=address" -Dcc=clang -Doptimize="-O1"
[stdio] -Duseithreads -Duse64bitall -Accflags=-DPERL_GLOBAL_STRUCT
Inconsistent test results (between TEST and harness):
    ../t/cpan/Module-Build/t/test_type.t.... ................................ FAILED--no leader found
    ../t/cpan/ExtUtils-MakeMaker/t/basic.t.. .............................. FAILED at test 61
    ../t/cpan/podlators/t/man-options.t..... ................................. FAILED at test 3
    ../t/dist/Tie-File/t/06_fixrec.t........ .................................... FAILED--expected 5 tests, saw 2
    ../t/dist/Tie-File/t/24_cache_loop.t.... ................................ FAILED--expected 3 tests, saw 2
    ../t/cpan/Test-Harness/t/source.t....... ................................... FAILED at test 37
    ../ext/PerlIO-encoding/t/encoding.t..... ............................... FAILED--expected 24 tests, saw 0
    ../t/cpan/Module-Build/t/write_default_maniskip.t .................... FAILED--no leader found
    ../t/cpan/Pod-Parser/t/pod/nested_items.t ............................ FAILED--expected 1 tests, saw 0
    ../t/cpan/IO-Compress/t/109merge-gzip.t. .............................. FAILED at test 6
    ../t/cpan/Module-Build/t/basic.t........ .................................... FAILED--no leader found
    ../ext/Pod-Html/t/htmldir4.t............ ...................................... FAILED--expected 2 tests, saw 0
    ../t/cpan/IO-Compress/t/107multi-bzip2.t ............................. FAILED at test 6
    ../t/cpan/Test/t/fail.t................. ............................................. FAILED at test 1
    ../t/cpan/Pod-Parser/t/pod/include.t.... ................................ FAILED--expected 1 tests, saw 0
    ../t/cpan/Pod-Parser/t/pod/emptycmd.t... ............................... FAILED--expected 1 tests, saw 0
    ../t/cpan/ExtUtils-MakeMaker/t/recurs.t. .............................. FAILED at test 3
    ../t/cpan/Module-Build/t/mymeta.t....... ................................... FAILED--no leader found
    ../t/cpan/File-Temp/t/cmp.t............. ......................................... FAILED--expected 19 tests, saw 10
    ../t/cpan/IO-Compress/t/100generic-gzip.t ............................ FAILED at test 29
    ../t/cpan/podlators/t/termcap.t......... ..................................... FAILED at test 3
    ../t/cpan/IO-Compress/t/108anyunc-gzip.t ............................. FAILED at test 17
    ../t/cpan/IO-Compress/t/100generic-bzip2.t ........................... FAILED at test 66
    ../t/cpan/IO-Compress/t/104destroy-gzip.t ............................ FAILED--expected 15 tests, saw 4
    ../t/cpan/podlators/t/filehandle.t...... .................................. FAILED at test 5
    ../t/cpan/podlators/t/text.t............ ........................................ FAILED at test 3
    ../t/cpan/Module-Build/t/test_types.t... ............................... FAILED--no leader found
    ../ext/PerlIO-via/t/via.t............... ......................................... FAILED at test 8
    ../lib/h2ph.t........................... ..................................................... FAILED at test 1
    ../t/cpan/Test/t/skip.t................. ............................................. FAILED at test 2
    ../ext/B/t/optree_misc.t................ .......................................... FAILED at test 8
    ../t/cpan/podlators/t/man-heading.t..... ................................. FAILED at test 3
    ../ext/File-Glob/t/rt114984.t........... ..................................... FAILED--expected 1 tests, saw 0
    ../lib/File/Find/t/taint.t.............. ........................................ FAILED at test 3
    ../t/cpan/IO-Zlib/t/basic.t............. ......................................... FAILED at test 4
    ../t/cpan/Test-Harness/t/testargs.t..... ................................. FAILED--expected 21 tests, saw 8
    ../t/dist/Cwd/t/cwd.t................... ............................................... FAILED--expected 35 tests, saw 10
    ../t/dist/Tie-File/t/28_mtwrite.t....... ................................... FAILED--expected 2252 tests, saw 1
    ../t/dist/Tie-File/t/17_misc_meth.t..... ................................. FAILED--expected 35 tests, saw 2
    ../ext/IPC-Open3/t/fd.t................. ........................................... FAILED--expected 3 tests, saw 2
    ../t/dist/Tie-File/t/29_downcopy.t...... .................................. FAILED--expected 718 tests, saw 2
    ../t/dist/ExtUtils-Install/t/Packlist.t. .............................. FAILED at test 23
    ../t/cpan/Module-Build/t/metadata.t..... ................................. FAILED--no leader found
    ../t/cpan/HTTP-Tiny/t/130_redirect.t.... ................................ FAILED--no leader found
    ../t/dist/Tie-File/t/03_longfetch.t..... ................................. FAILED at test 3
    ../t/dist/Storable/t/retrieve.t......... ..................................... FAILED at test 1
    ../t/cpan/Module-Build/t/pod_parser.t... ............................... FAILED--no leader found
    ../t/cpan/ExtUtils-MakeMaker/t/VERSION_FROM.t ........................ FAILED--expected 1 tests, saw 0
    ../t/cpan/IO-Compress/t/108anyunc-bzip2.t ............................ FAILED at test 17
    ../lib/bytes.t.......................... .................................................... FAILED--expected 20 tests, saw 19
    ../t/cpan/Pod-Parser/t/pod/lref.t....... ................................... FAILED--expected 1 tests, saw 0
    ../ext/Pod-Html/t/cache.t............... ......................................... FAILED--expected 10 tests, saw 2
    ../t/cpan/Module-Build/t/properties/license.t ........................ FAILED--no leader found
    ../t/cpan/Test/t/mix.t.................. .............................................. FAILED at test 1
    ../t/dist/Tie-File/t/02_fetchsize.t..... ................................. FAILED at test 3
    ../t/dist/Storable/t/malice.t........... ....................................... FAILED at test 1
    ../t/cpan/Test-Harness/t/compat/env.t... ............................... FAILED at test 1
    ../t/dist/ExtUtils-Command/t/eu_command.t ............................ FAILED at test 10
    ../t/dist/ExtUtils-Install/t/Installed.t ............................. FAILED--expected 73 tests, saw 15
    ../t/cpan/Test-Harness/t/taint.t........ .................................... FAILED at test 1
    ../t/cpan/PerlIO-via-QuotedPrint/t/QuotedPrint.t ..................... FAILED at test 4
    ../t/dist/Tie-File/t/26_twrite.t........ .................................... FAILED--expected 181 tests, saw 1
    ../t/cpan/IO-Compress/t/102tied-bzip2.t. .............................. FAILED at test 18
    ../t/cpan/IO-Compress/t/105oneshot-zip.t ............................. FAILED--expected 989 tests, saw 8
    ../t/cpan/Pod-Usage/t/pod/pod2usage.t... ............................... FAILED--expected 1 tests, saw 0
    ../t/dist/Tie-File/t/05_size.t.......... ...................................... FAILED at test 5
    ../t/cpan/IO-Compress/t/102tied-deflate.t ............................ FAILED at test 18
    ../t/cpan/Pod-Parser/t/pod/included.t... ............................... FAILED--expected 1 tests, saw 0
    ../t/cpan/IO-Zlib/t/uncomp2.t........... ....................................... FAILED at test 3
    ../t/cpan/podlators/t/man-perlio.t...... .................................. FAILED at test 4
    ../t/cpan/Module-Metadata/t/metadata.t.. .............................. FAILED--no leader found
    ../ext/Pod-Html/t/feature2.t............ ...................................... FAILED--expected 2 tests, saw 0
    ../ext/XS-Typemap/t/Typemap.t........... ..................................... FAILED at test 135
    ../t/cpan/IO-Compress/t/103newtied-rawdeflate.t ...................... FAILED at test 15
    ../t/cpan/Module-Build/t/properties/requires.t ....................... FAILED--no leader found
    ../t/dist/SelfLoader/t/01SelfLoader.t... ............................... FAILED--expected 20 tests, saw 0
    ../t/cpan/IO-Compress/t/107multi-deflate.t ........................... FAILED at test 6
    ../t/cpan/Pod-Checker/t/pod/poderrs.t... ............................... FAILED--expected 1 tests, saw 0
    ../lib/DBM_Filter/t/01error.t........... ..................................... FAILED--expected 21 tests, saw 3
    ../t/cpan/podlators/t/text-perlio.t..... ................................. FAILED at test 3
    ../t/cpan/File-Temp/t/object.t.......... ...................................... FAILED--expected 35 tests, saw 7
    ../t/cpan/Module-Build/t/properties/needs_compiler.t ................. FAILED--no leader found
    ../t/cpan/IO-Compress/t/100generic-deflate.t ......................... FAILED at test 66
    ../t/cpan/ExtUtils-MakeMaker/t/writemakefile_args.t .................. FAILED--expected 39 tests, saw 2
    ../t/cpan/IO-Compress/t/102tied-rawdeflate.t ......................... FAILED at test 18
    ../t/cpan/IO-Compress/t/104destroy-bzip2.t ........................... FAILED--expected 15 tests, saw 4
    ../t/cpan/IO-Compress/t/103newtied-gzip.t ............................ FAILED at test 15
    ../ext/POSIX/t/wrappers.t............... ......................................... FAILED at test 68
    ../ext/FileCache/t/04twoarg.t........... ..................................... FAILED at test 1
    ../t/cpan/File-Path/t/Path.t............ ........................................ FAILED at test 5
    ../t/dist/Storable/t/blessed.t.......... ...................................... FAILED--expected 83 tests, saw 66
    ../t/cpan/IO-Compress/t/006zip.t........ .................................... FAILED at test 37
    ../t/dist/Tie-File/t/25_gen_nocache.t... ............................... FAILED--expected 68 tests, saw 2
    ../t/cpan/Pod-Simple/t/htmlbat.t........ .................................... FAILED--expected 17 tests, saw 2
    ../t/cpan/IO-Compress/t/106prime-deflate.t ........................... FAILED at test 2
    ../t/cpan/podlators/t/text-options.t.... ................................ FAILED at test 3
    ../t/dist/threads/t/thread.t............ ........................................ FAILED--expected 35 tests, saw 26
    ../t/cpan/IO-Compress/t/101truncate-rawdeflate.t ..................... FAILED at test 36
    ../t/cpan/IO-Compress/t/105oneshot-gzip.t ............................ FAILED--expected 989 tests, saw 8
    ../t/cpan/Module-Build/t/properties/dist_suffix.t .................... FAILED--no leader found
    ../t/dist/ExtUtils-Install/t/Installapi2.t ........................... FAILED--expected 70 tests, saw 7
    ../t/dist/Storable/t/file_magic.t....... ................................... FAILED--expected 79 tests, saw 3
    ../t/dist/Tie-File/t/01_gen.t........... ....................................... FAILED--expected 75 tests, saw 2
    ../t/cpan/Test-Harness/t/harness.t...... .................................. FAILED--expected 132 tests, saw 125
    ../t/cpan/Module-Build/t/metadata2.t.... ................................ FAILED--no leader found
    ../t/cpan/Module-Build/t/actions/installdeps.t ....................... FAILED--no leader found
    ../t/cpan/Test-Harness/t/perl5lib.t..... ................................. FAILED at test 1
    ../t/cpan/IO-Compress/t/110encode-gzip.t ............................. FAILED at test 2
    ../t/cpan/Module-Build/t/runthrough.t... ............................... FAILED--no leader found
    ../ext/XS-APItest/t/printf.t............ ...................................... FAILED at test 6
    ../t/cpan/Memoize/t/tie_sdbm.t.......... ...................................... FAILED--expected 4 tests, saw 0
    ../t/cpan/HTTP-Tiny/t/102_put.t......... ..................................... FAILED--no leader found
    ../t/dist/SelfLoader/t/03taint.t........ .................................... FAILED--expected 20 tests, saw 0
    ../t/cpan/IO-Compress/t/108anyunc-deflate.t .......................... FAILED at test 17
    ../t/dist/lib/t/01lib.t................. ............................................. FAILED--expected 13 tests, saw 0
    ../t/cpan/podlators/t/man-utf8.t........ .................................... FAILED at test 4
    ../t/dist/Storable/t/lock.t............. ......................................... FAILED at test 1
    ../t/cpan/IO-Compress/t/105oneshot-zip-only.t ........................ FAILED at test 6
    ../t/cpan/Module-Build/t/compat.t....... ................................... FAILED--no leader found
    ../t/cpan/Module-Build/t/sample.t....... ................................... FAILED--no leader found
    ../t/cpan/Module-Build/t/new_from_context.t .......................... FAILED--no leader found
    ../t/dist/Tie-File/t/15_pushpop.t....... ................................... FAILED--expected 38 tests, saw 2
    ../t/cpan/Pod-LaTeX/t/pod2latex.t....... ................................... FAILED--expected 177 tests, saw 2
    ../t/dist/Tie-File/t/09_gen_rs.t........ .................................... FAILED--expected 59 tests, saw 2
    ../t/cpan/IO-Compress/t/108anyunc-zip.t. .............................. FAILED at test 17
    ../ext/Fcntl/t/syslfs.t................. ........................................... FAILED--no leader found
    ../t/dist/Cwd/t/rel2abs2rel.t........... ....................................... FAILED at test 1
    ../ext/XS-APItest/t/clone-with-stack.t.. ............................. FAILED--expected 4 tests, saw 0
    ../t/cpan/Module-Build/t/properties/module_name.t .................... FAILED--no leader found
    ../t/cpan/ExtUtils-MakeMaker/t/prereq.t. .............................. FAILED--expected 16 tests, saw 5
    ../t/cpan/IO-Compress/t/104destroy-zip.t ............................. FAILED--expected 15 tests, saw 4
    ../t/cpan/IO-Compress/t/109merge-rawdeflate.t ........................ FAILED at test 6
    ../t/cpan/IO-Compress/t/010examples-bzip2.t .......................... FAILED at test 4
    ../t/cpan/IO-Compress/t/cz-03zlib-v1.t.. .............................. FAILED at test 88
    ../t/cpan/Memoize/t/tie_gdbm.t.......... ...................................... FAILED--expected 4 tests, saw 0
    ../t/dist/Tie-File/t/22_autochomp.t..... ................................. FAILED--expected 71 tests, saw 2
    ../t/cpan/Pod-LaTeX/t/user.t............ ........................................ FAILED--expected 17 tests, saw 2
    ../lib/File/Copy.t...................... ................................................ FAILED at test 8
    ../t/cpan/Module-Build/t/extend.t....... ................................... FAILED--no leader found
    ../ext/FileCache/t/03append.t........... ..................................... FAILED at test 1
    ../t/cpan/IO-Compress/t/110encode-rawdeflate.t ....................... FAILED at test 2
    ../lib/blib.t........................... ..................................................... FAILED--expected 7 tests, saw 1
    ../t/dist/Storable/t/utf8hash.t......... ..................................... FAILED at test 9
    ../t/cpan/Module-Build/t/actions/manifest_skip.t ..................... FAILED--no leader found
    ../ext/PerlIO-encoding/t/fallback.t..... ............................... FAILED at test 3
    ../t/cpan/Test-Harness/t/compat/inc-propagation.t .................... FAILED at test 1
    ../t/cpan/IO-Compress/t/103newtied-bzip2.t ........................... FAILED at test 15
    ../ext/XS-APItest/t/call.t.............. ........................................ FAILED--expected 436 tests, saw 435
    ../t/dist/Tie-File/t/32_defer_misc.t.... ................................ FAILED at test 6
    ../t/dist/ExtUtils-ParseXS/t/106-process_typemaps.t .................. FAILED--expected 2 tests, saw 0
    ../t/cpan/Module-Build/t/parents.t...... .................................. FAILED--no leader found
    ../t/dist/Tie-File/t/11_rv_splice_rs.t.. .............................. FAILED--expected 50 tests, saw 2
    ../t/cpan/Module-Build/t/notes.t........ .................................... FAILED--no leader found
    ../t/dist/Tie-File/t/10_splice_rs.t..... ................................. FAILED--expected 101 tests, saw 2
    ../t/dist/ExtUtils-Install/t/InstallWithMM.t ......................... FAILED--expected 15 tests, saw 2
    ../t/dist/IO/t/io_dir.t................. ............................................. FAILED--expected 16 tests, saw 9
    ../ext/Pod-Html/t/feature.t............. ....................................... FAILED--expected 1 tests, saw 0
    ../t/cpan/ExtUtils-MakeMaker/t/pm_to_blib.t .......................... FAILED at test 3
    ../t/cpan/Module-Build/t/bundle_inc.t... ............................... FAILED--no leader found
    ../ext/File-Glob/t/basic.t.............. ........................................ FAILED at test 14
    ../t/cpan/Module-Build/t/versions.t..... ................................. FAILED--no leader found
    ../t/cpan/Pod-Parser/t/pod/multiline_items.t ......................... FAILED--expected 1 tests, saw 0
    ../t/cpan/Module-Build/t/install.t...... .................................. FAILED--no leader found
    ../t/cpan/ExtUtils-MakeMaker/t/WriteEmptyMakefile.t .................. FAILED--expected 5 tests, saw 4
    ../t/cpan/podlators/t/overstrike.t...... .................................. FAILED at test 3
    ../t/cpan/IO-Zlib/t/getline.t........... ....................................... FAILED at test 3
    ../t/cpan/IO-Compress/t/globmapper.t.... ................................ FAILED--expected 68 tests, saw 23
    ../t/cpan/IO-Zlib/t/tied.t.............. .......................................... FAILED at test 6
    ../t/cpan/Module-Build/t/debug.t........ .................................... FAILED--no leader found
    ../t/dist/IO/t/io_file.t................ ............................................ FAILED at test 6
    ../lib/File/Find/t/find.t............... ......................................... FAILED at test 3
    ../t/cpan/Pod-Parser/t/pod/special_seqs.t ............................ FAILED--expected 1 tests, saw 0
    ../t/cpan/IO-Compress/t/109merge-deflate.t ........................... FAILED at test 6
    ../t/dist/ExtUtils-CBuilder/t/04-base.t. .............................. FAILED--expected 64 tests, saw 10
    ../ext/Devel-Peek/t/Peek.t.............. ........................................ FAILED at test 1
    ../t/cpan/Module-Build/t/install_extra_target.t ...................... FAILED--no leader found
    ../t/cpan/podlators/t/text-utf8.t....... ................................... FAILED at test 3
    ../lib/DBM_Filter/t/compress.t.......... .................................... FAILED--expected 23 tests, saw 8
    ../lib/open.t........................... ..................................................... FAILED at test 10
    ../t/cpan/IO-Compress/t/105oneshot-zip-bzip2-only.t .................. FAILED--expected 248 tests, saw 3
    ../lib/DBM_Filter/t/02core.t............ ...................................... FAILED--expected 189 tests, saw 3
    ../t/cpan/HTTP-Tiny/t/100_get.t......... ..................................... FAILED at test 46
    ../ext/GDBM_File/t/fatal.t.............. ........................................ FAILED at test 4
    ../t/cpan/IO-Compress/t/110encode-bzip2.t ............................ FAILED at test 2
    ../t/cpan/Pod-Parser/t/pod/podselect.t.. .............................. FAILED--expected 1 tests, saw 0
    ../t/cpan/IO-Compress/t/101truncate-bzip2.t .......................... FAILED at test 13
    ../t/cpan/Module-Build/t/xs.t........... ....................................... FAILED--no leader found
    ../t/cpan/IO-Compress/t/cz-14gzopen.t... ............................... FAILED at test 13
    ../t/dist/Tie-File/t/42_offset.t........ .................................... FAILED--expected 24 tests, saw 4
    ../t/cpan/Pod-Checker/t/pod/podchkenc.t. .............................. FAILED--expected 1 tests, saw 0
    ../t/cpan/Test/t/todo.t................. ............................................. FAILED at test 1
    ../t/dist/Tie-File/t/08_ro.t............ ........................................ FAILED at test 3
    ../t/cpan/IO-Compress/t/106prime-rawdeflate.t ........................ FAILED at test 2
    ../ext/Pod-Html/t/htmlescp.t............ ...................................... FAILED--expected 1 tests, saw 0
    ../t/cpan/IO-Zlib/t/getc.t.............. .......................................... FAILED at test 3
    ../t/cpan/IO-Compress/t/050interop-gzip.t ............................ FAILED at test 4
    ../t/dist/IO/t/io_dup.t................. ............................................. FAILED--expected test 2, saw test 6
    ../t/cpan/Module-Build/t/properties/release_status.t ................. FAILED--no leader found
    ../t/cpan/Test-Harness/t/nofork.t....... ................................... FAILED at test 1
    ../t/cpan/Module-Build/t/destinations.t. .............................. FAILED--no leader found
    ../t/cpan/podlators/t/pod-parser.t...... .................................. FAILED at test 4
    ../ext/Fcntl/t/fcntl.t.................. ............................................ FAILED at test 3
    ../t/dist/Tie-File/t/27_iwrite.t........ .................................... FAILED--expected 203 tests, saw 1
    ../t/cpan/IO-Compress/t/cz-05examples.t. .............................. FAILED at test 4
    ../t/cpan/Test-Harness/t/spool.t........ .................................... FAILED at test 1
    ../t/dist/ExtUtils-Install/t/Install.t.. .............................. FAILED--expected 52 tests, saw 7
    ../ext/B/t/xref.t....................... ................................................. FAILED at test 3
    ../t/dist/Tie-File/t/13_size_rs.t....... ................................... FAILED at test 5
    ../t/dist/IO/t/cachepropagate-unix.t.... ................................ FAILED--expected 15 tests, saw 0
    ../t/cpan/podlators/t/text-encoding.t... ............................... FAILED at test 3
    ../t/dist/ExtUtils-Install/t/can_write_dir.t ......................... FAILED at test 5
    ../t/dist/Storable/t/forgive.t.......... ...................................... FAILED at test 3
    ../ext/NDBM_File/t/ndbm.t............... ......................................... FAILED at test 3
    ../ext/Pod-Html/t/htmlview.t............ ...................................... FAILED--expected 1 tests, saw 0
    ../t/cpan/ExtUtils-MakeMaker/t/build_man.t ........................... FAILED--expected 9 tests, saw 8
    ../t/cpan/Module-Build/t/script_dist.t.. .............................. FAILED--no leader found
    ../lib/h2xs.t........................... ..................................................... FAILED at test 2
    ../t/cpan/IO-Compress/t/105oneshot-deflate.t ......................... FAILED--expected 989 tests, saw 8
    ../t/cpan/Memoize/t/expfile.t........... ....................................... FAILED at test 12
    ../t/cpan/IO-Compress/t/104destroy-rawdeflate.t ...................... FAILED--expected 15 tests, saw 4
    ../t/dist/Tie-File/t/29a_upcopy.t....... ................................... FAILED--expected 55 tests, saw 1
    ../t/cpan/IO-Zlib/t/large.t............. ......................................... FAILED at test 3
    ../t/cpan/podlators/t/color.t........... ....................................... FAILED at test 3
    ../t/cpan/Module-Build/t/perl_mb_opt.t.. .............................. FAILED--no leader found
    ../t/cpan/IO-Compress/t/107multi-rawdeflate.t ........................ FAILED at test 6
    ../t/cpan/IO-Compress/t/101truncate-gzip.t ........................... FAILED at test 87
    ../t/cpan/IO-Compress/t/103newtied-zip.t ............................. FAILED at test 15
    ../t/dist/Tie-File/t/12_longfetch_rs.t.. .............................. FAILED at test 3
    ../t/cpan/IO-Compress/t/106prime-bzip2.t ............................. FAILED at test 2
    ../t/dist/ExtUtils-ParseXS/t/001-basic.t ............................. FAILED at test 11
    ../t/cpan/Memoize/t/errors.t............ ........................................ FAILED at test 5
    ../ext/XS-APItest/t/my_exit.t........... ..................................... FAILED--expected 4 tests, saw 0
    ../t/cpan/Pod-Parser/t/pod/nested_seqs.t ............................. FAILED--expected 1 tests, saw 0
    ../lib/ExtUtils/t/Embed.t............... ......................................... FAILED at test 1
    ../t/dist/Tie-File/t/07_rv_splice.t..... ................................. FAILED--expected 56 tests, saw 2
    ../t/cpan/IO-Compress/t/010examples-zlib.t ........................... FAILED at test 4
    ../t/cpan/IO-Compress/t/106prime-gzip.t. .............................. FAILED at test 2
    ../lib/AnyDBM_File.t.................... .............................................. FAILED at test 1
    ../ext/Pod-Html/t/poderr.t.............. ........................................ FAILED--expected 1 tests, saw 0
    ../ext/Pod-Html/t/htmldir2.t............ ...................................... FAILED--expected 3 tests, saw 0
    ../t/dist/Tie-File/t/31_autodefer.t..... ................................. FAILED--expected 65 tests, saw 2
    ../ext/ODBM_File/t/odbm.t............... ......................................... FAILED--no leader found
    ../lib/DBM_Filter/t/encode.t............ ...................................... FAILED--expected 26 tests, saw 10
    ../ext/SDBM_File/t/sdbm.t............... ......................................... FAILED--no leader found
    ../t/cpan/File-Temp/t/rmtree.t.......... ...................................... FAILED--expected 1 tests, saw 0
    ../t/cpan/Module-Build/t/tilde.t........ .................................... FAILED--no leader found
    ../t/cpan/Filter-Util-Call/t/call.t..... ................................. FAILED--expected 32 tests, saw 0
    ../t/cpan/Module-Build/t/help.t......... ..................................... FAILED--no leader found
    ../t/cpan/IO-Compress/t/001bzip2.t...... .................................. FAILED at test 67
    ../t/cpan/IO-Compress/t/104destroy-deflate.t ......................... FAILED--expected 15 tests, saw 4
    ../lib/feature.t........................ .................................................. FAILED--no leader found
    ../t/cpan/podlators/t/man.t............. ......................................... FAILED at test 3
    ../ext/Pod-Html/t/podnoerr.t............ ...................................... FAILED--expected 1 tests, saw 0
    ../t/dist/Tie-File/t/18_rs_fixrec.t..... ................................. FAILED--expected 5 tests, saw 2
    ../t/cpan/Module-Build/t/ppm.t.......... ...................................... FAILED--no leader found
    ../t/cpan/IO-Compress/t/002any-zip.t.... ................................ FAILED at test 17
    ../t/cpan/IO-Compress/t/101truncate-deflate.t ........................ FAILED at test 9
    ../t/cpan/IO-Compress/t/107multi-gzip.t. .............................. FAILED at test 6
    ../lib/File/stat.t...................... ................................................ FAILED--no leader found
    ../lib/File/Compare.t................... ............................................. FAILED at test 11
    ../t/cpan/Module-Build/t/use_tap_harness.t ........................... FAILED--no leader found
    ../t/cpan/IO-Compress/t/107multi-zip.t.. .............................. FAILED at test 6
    ../t/cpan/IO-Compress/t/100generic-zip.t ............................. FAILED at test 29
    ../t/cpan/Memoize/t/tie.t............... ........................................... FAILED--expected 4 tests, saw 0
    ../t/cpan/Module-Build/t/test_file_exts.t ............................ FAILED--no leader found
    ../t/cpan/Memoize/t/tie_ndbm.t.......... ...................................... FAILED--expected 4 tests, saw 0
    ../t/cpan/HTTP-Tiny/t/040_content.t..... ................................. FAILED--no leader found
    ../t/dist/IO/t/io_utf8.t................ ............................................ FAILED at test 5
    ../t/cpan/Test-Simple/t/exit.t.......... ...................................... FAILED at test 1
    ../t/dist/Tie-File/t/33_defer_vs.t...... .................................. FAILED at test 4
    ../t/cpan/Module-Build/t/ext.t.......... ...................................... FAILED--no leader found
    ../t/cpan/Pod-Parser/t/pod/for.t........ .................................... FAILED--expected 1 tests, saw 0
    ../t/cpan/HTTP-Tiny/t/150_post_form.t... ............................... FAILED--no leader found
    ../t/cpan/podlators/t/basic.t........... ....................................... FAILED at test 6
    ../t/dist/Devel-SelfStubber/t/Devel-SelfStubber.t .................... FAILED--expected 12 tests, saw 0
    ../t/cpan/IO-Compress/t/100generic-rawdeflate.t ...................... FAILED at test 29
    ../lib/overload.t....................... ................................................. FAILED--expected 5191 tests, saw 5009
    ../t/dist/ExtUtils-Manifest/t/Manifest.t ............................. FAILED at test 2
    ../t/dist/Tie-File/t/04_splice.t........ .................................... FAILED--expected 118 tests, saw 2
    ../t/cpan/HTTP-Tiny/t/101_head.t........ .................................... FAILED--no leader found
    ../t/cpan/Pod-Simple/t/puller.t......... ..................................... FAILED at test 89
    ../t/cpan/Test-Simple/t/Builder/output.t ............................. FAILED at test 2
    ../t/dist/Tie-File/t/19_cache.t......... ..................................... FAILED--expected 55 tests, saw 2
    ../t/cpan/File-Path/t/taint.t........... ....................................... FAILED--expected 6 tests, saw 2
    ../ext/FileCache/t/02maxopen.t.......... .................................... FAILED at test 5
    ../t/cpan/IO-Zlib/t/uncomp1.t........... ....................................... FAILED at test 3
    ../t/cpan/Module-Build/t/PL_files.t..... ................................. FAILED--no leader found
    ../t/cpan/ExtUtils-MakeMaker/t/postamble.t ........................... FAILED--expected 8 tests, saw 5
    ../t/cpan/ExtUtils-MakeMaker/t/INSTALL_BASE.t ........................ FAILED at test 5
    ../t/dist/Storable/t/code.t............. ......................................... FAILED--expected 63 tests, saw 11
    ../t/dist/IO/t/io_utf8argv.t............ ........................................ FAILED--expected 2 tests, saw 0
    ../t/cpan/ExtUtils-MakeMaker/t/several_authors.t ..................... FAILED--expected 20 tests, saw 2
    ../t/cpan/IO-Compress/t/110encode-zip.t. .............................. FAILED at test 2
    ../ext/Pod-Html/t/eol.t................. ........................................... FAILED--expected 3 tests, saw 0
    ../t/cpan/Module-Build/t/compat/exit.t.. .............................. FAILED--no leader found
    ../t/cpan/IO-Compress/t/001zlib-generic-deflate.t .................... FAILED at test 7
    ../t/cpan/IO-Compress/t/108anyunc-rawdeflate.t ....................... FAILED at test 17
    ../t/cpan/IO-Compress/t/105oneshot-gzip-only.t ....................... FAILED at test 6
    ../t/dist/Storable/t/integer.t.......... ...................................... FAILED at test 527
    ../t/cpan/IO-Compress/t/cz-08encoding.t. .............................. FAILED at test 16
    ../t/dist/threads/t/kill2.t............. ......................................... FAILED--expected 3 tests, saw 0
    ../t/cpan/Module-Build/t/add_property.t. .............................. FAILED--no leader found
    ../t/cpan/IO-Compress/t/cz-06gzsetp.t... ............................... FAILED at test 8
    ../ext/FileCache/t/07noimport.t......... ................................... FAILED at test 1
    ../t/cpan/IO-Compress/t/103newtied-deflate.t ......................... FAILED at test 15
    ../t/cpan/Pod-Parser/t/pod/oneline_cmds.t ............................ FAILED--expected 1 tests, saw 0
    ../t/cpan/Module-Build/t/resume.t....... ................................... FAILED--no leader found
    ../t/cpan/IO-Compress/t/110encode-deflate.t .......................... FAILED at test 2
    ../lib/charnames.t...................... ................................................ FAILED--no leader found
    ../t/dist/IO/t/io_xs.t.................. .............................................. FAILED at test 2
    ../lib/DBM_Filter/t/null.t.............. ........................................ FAILED--expected 26 tests, saw 7
    ../t/dist/Tie-File/t/30_defer.t......... ..................................... FAILED at test 4
    ../t/dist/Storable/t/store.t............ ........................................ FAILED at test 1
    ../t/dist/Tie-File/t/20_cache_full.t.... ................................ FAILED at test 3
    ../t/cpan/IO-Compress/t/102tied-zip.t... ............................... FAILED at test 18
    ../t/cpan/Module-Build/t/00-compile.t... ............................... FAILED--no leader found
    ../t/cpan/IO-Compress/t/105oneshot-bzip2.t ........................... FAILED--expected 989 tests, saw 8
    ../t/cpan/Module-Build/t/properties/share_dir.t ...................... FAILED--no leader found
    ../t/cpan/IO-Compress/t/101truncate-zip.t ............................ FAILED at test 133
    ../t/cpan/HTTP-Tiny/t/110_mirror.t...... .................................. FAILED--no leader found
    ../t/dist/ExtUtils-ParseXS/t/512-t-file.t ............................ FAILED--expected 6 tests, saw 1
    ../t/dist/Tie-File/t/23_rv_ac_splice.t.. .............................. FAILED--expected 50 tests, saw 2
    ../ext/Pod-Html/t/htmllink.t............ ...................................... FAILED--expected 1 tests, saw 0
    ../t/cpan/IO-Compress/t/102tied-gzip.t.. .............................. FAILED at test 18
    ../t/cpan/IO-Compress/t/106prime-zip.t.. .............................. FAILED at test 2
    ../t/cpan/IO-Compress/t/105oneshot-rawdeflate.t ...................... FAILED--expected 989 tests, saw 8
    ../t/dist/Storable/t/weak.t............. ......................................... FAILED at test 11
    ../ext/B/t/o.t.......................... .................................................... FAILED--no leader found
    ../lib/DBM_Filter/t/utf8.t.............. ........................................ FAILED--expected 20 tests, saw 9
    ../t/cpan/Term-UI/t/01_history.t........ .................................... FAILED at test 10
    ../ext/GDBM_File/t/gdbm.t............... ......................................... FAILED at test 4
    ../lib/DBM_Filter/t/int32.t............. ....................................... FAILED--expected 22 tests, saw 7
    ../t/cpan/Module-Build/t/files.t........ .................................... FAILED--no leader found
    ../t/dist/Search-Dict/t/Dict.t.......... ...................................... FAILED at test 1
    ../t/cpan/IO-Compress/t/004gziphdr.t.... ................................ FAILED at test 166
    ../t/cpan/Pod-Parser/t/pod/headings.t... ............................... FAILED--expected 1 tests, saw 0
    ../t/cpan/Module-Build/t/manifypods.t... ............................... FAILED--no leader found
    ../t/dist/Tie-File/t/16_handle.t........ .................................... FAILED--expected 39 tests, saw 2

[perlio] -Duseithreads -Duse64bitall -Accflags=-DPERL_GLOBAL_STRUCT
Inconsistent test results (between TEST and harness):
    ../t/dist/ExtUtils-Command/t/eu_command.t ............................ FAILED at test 3
    ../lib/ExtUtils/t/Embed.t............... ......................................... FAILED at test 1

[en_US.utf8] -Duseithreads -Duse64bitall -Accflags=-DPERL_GLOBAL_STRUCT
Inconsistent test results (between TEST and harness):
    ../lib/ExtUtils/t/Embed.t............... ......................................... FAILED at test 1

Compiler messages(gcc):
Call.xs:63:11: warning: format specifies type 'int' but the argument has type 'STRLEN' (aka 'unsigned long') [-Wformat]
Call.xs:63:31: warning: format specifies type 'int' but the argument has type 'STRLEN' (aka 'unsigned long') [-Wformat]
Call.xs:100:13: warning: format specifies type 'int' but the argument has type 'STRLEN' (aka 'unsigned long') [-Wformat]
Call.xs:156:11: warning: format specifies type 'int' but the argument has type 'STRLEN' (aka 'unsigned long') [-Wformat]
Call.xs:175:14: warning: format specifies type 'int' but the argument has type 'STRLEN' (aka 'unsigned long') [-Wformat]
Storable.xs:4068:2: warning: null passed to a callee which requires a non-null argument [-Wnonnull]
Storable.xs:4255:10: warning: null passed to a callee which requires a non-null argument [-Wnonnull]
Storable.xs:5550:2: warning: null passed to a callee which requires a non-null argument [-Wnonnull]
Storable.xs:5613:2: warning: null passed to a callee which requires a non-null argument [-Wnonnull]
Collate.xs:616:2: warning: expression result unused [-Wunused-value]
Collate.xs:606:2: warning: expression result unused [-Wunused-value]
util.c:3667:12: warning: returning 'const MGVTBL *' (aka 'const struct mgvtbl *') from a function with result type 'MGVTBL *' (aka 'struct mgvtbl *') discards qualifiers [-Wincompatible-pointer-types-discards-qualifiers]
APItest.xs:3525:2: warning: assigning to 'MGVTBL *' (aka 'struct mgvtbl *') from 'const MGVTBL *' (aka 'const struct mgvtbl *') discards qualifiers [-Wincompatible-pointer-types-discards-qualifiers]
APItest.xs:3526:2: warning: assigning to 'MGVTBL *' (aka 'struct mgvtbl *') from 'const MGVTBL *' (aka 'const struct mgvtbl *') discards qualifiers [-Wincompatible-pointer-types-discards-qualifiers]
APItest.xs:3527:2: warning: assigning to 'MGVTBL *' (aka 'struct mgvtbl *') from 'const MGVTBL *' (aka 'const struct mgvtbl *') discards qualifiers [-Wincompatible-pointer-types-discards-qualifiers]
APItest.xs:3528:2: warning: assigning to 'MGVTBL *' (aka 'struct mgvtbl *') from 'const MGVTBL *' (aka 'const struct mgvtbl *') discards qualifiers [-Wincompatible-pointer-types-discards-qualifiers]
APItest.xs:3529:2: warning: assigning to 'MGVTBL *' (aka 'struct mgvtbl *') from 'const MGVTBL *' (aka 'const struct mgvtbl *') discards qualifiers [-Wincompatible-pointer-types-discards-qualifiers]
APItest.xs:3530:2: warning: assigning to 'MGVTBL *' (aka 'struct mgvtbl *') from 'const MGVTBL *' (aka 'const struct mgvtbl *') discards qualifiers [-Wincompatible-pointer-types-discards-qualifiers]
APItest.xs:3531:2: warning: assigning to 'MGVTBL *' (aka 'struct mgvtbl *') from 'const MGVTBL *' (aka 'const struct mgvtbl *') discards qualifiers [-Wincompatible-pointer-types-discards-qualifiers]
APItest.xs:3532:2: warning: assigning to 'MGVTBL *' (aka 'struct mgvtbl *') from 'const MGVTBL *' (aka 'const struct mgvtbl *') discards qualifiers [-Wincompatible-pointer-types-discards-qualifiers]
APItest.xs:3533:2: warning: assigning to 'MGVTBL *' (aka 'struct mgvtbl *') from 'const MGVTBL *' (aka 'const struct mgvtbl *') discards qualifiers [-Wincompatible-pointer-types-discards-qualifiers]
APItest.xs:3534:2: warning: assigning to 'MGVTBL *' (aka 'struct mgvtbl *') from 'const MGVTBL *' (aka 'const struct mgvtbl *') discards qualifiers [-Wincompatible-pointer-types-discards-qualifiers]
APItest.xs:3535:2: warning: assigning to 'MGVTBL *' (aka 'struct mgvtbl *') from 'const MGVTBL *' (aka 'const struct mgvtbl *') discards qualifiers [-Wincompatible-pointer-types-discards-qualifiers]
APItest.xs:3536:2: warning: assigning to 'MGVTBL *' (aka 'struct mgvtbl *') from 'const MGVTBL *' (aka 'const struct mgvtbl *') discards qualifiers [-Wincompatible-pointer-types-discards-qualifiers]
APItest.xs:3537:2: warning: assigning to 'MGVTBL *' (aka 'struct mgvtbl *') from 'const MGVTBL *' (aka 'const struct mgvtbl *') discards qualifiers [-Wincompatible-pointer-types-discards-qualifiers]
APItest.xs:3538:2: warning: assigning to 'MGVTBL *' (aka 'struct mgvtbl *') from 'const MGVTBL *' (aka 'const struct mgvtbl *') discards qualifiers [-Wincompatible-pointer-types-discards-qualifiers]
APItest.xs:3539:2: warning: assigning to 'MGVTBL *' (aka 'struct mgvtbl *') from 'const MGVTBL *' (aka 'const struct mgvtbl *') discards qualifiers [-Wincompatible-pointer-types-discards-qualifiers]
APItest.xs:3540:2: warning: assigning to 'MGVTBL *' (aka 'struct mgvtbl *') from 'const MGVTBL *' (aka 'const struct mgvtbl *') discards qualifiers [-Wincompatible-pointer-types-discards-qualifiers]
APItest.xs:3541:2: warning: assigning to 'MGVTBL *' (aka 'struct mgvtbl *') from 'const MGVTBL *' (aka 'const struct mgvtbl *') discards qualifiers [-Wincompatible-pointer-types-discards-qualifiers]
APItest.xs:3542:2: warning: assigning to 'MGVTBL *' (aka 'struct mgvtbl *') from 'const MGVTBL *' (aka 'const struct mgvtbl *') discards qualifiers [-Wincompatible-pointer-types-discards-qualifiers]
APItest.xs:3543:2: warning: assigning to 'MGVTBL *' (aka 'struct mgvtbl *') from 'const MGVTBL *' (aka 'const struct mgvtbl *') discards qualifiers [-Wincompatible-pointer-types-discards-qualifiers]
APItest.xs:3544:2: warning: assigning to 'MGVTBL *' (aka 'struct mgvtbl *') from 'const MGVTBL *' (aka 'const struct mgvtbl *') discards qualifiers [-Wincompatible-pointer-types-discards-qualifiers]
APItest.xs:3545:2: warning: assigning to 'MGVTBL *' (aka 'struct mgvtbl *') from 'const MGVTBL *' (aka 'const struct mgvtbl *') discards qualifiers [-Wincompatible-pointer-types-discards-qualifiers]
APItest.xs:3546:2: warning: assigning to 'MGVTBL *' (aka 'struct mgvtbl *') from 'const MGVTBL *' (aka 'const struct mgvtbl *') discards qualifiers [-Wincompatible-pointer-types-discards-qualifiers]
APItest.xs:3547:2: warning: assigning to 'MGVTBL *' (aka 'struct mgvtbl *') from 'const MGVTBL *' (aka 'const struct mgvtbl *') discards qualifiers [-Wincompatible-pointer-types-discards-qualifiers]
APItest.xs:3549:2: warning: assigning to 'MGVTBL *' (aka 'struct mgvtbl *') from 'const MGVTBL *' (aka 'const struct mgvtbl *') discards qualifiers [-Wincompatible-pointer-types-discards-qualifiers]
APItest.xs:3551:2: warning: assigning to 'MGVTBL *' (aka 'struct mgvtbl *') from 'const MGVTBL *' (aka 'const struct mgvtbl *') discards qualifiers [-Wincompatible-pointer-types-discards-qualifiers]
APItest.xs:3552:2: warning: assigning to 'MGVTBL *' (aka 'struct mgvtbl *') from 'const MGVTBL *' (aka 'const struct mgvtbl *') discards qualifiers [-Wincompatible-pointer-types-discards-qualifiers]
dump.c:2662:57: warning: comparison of constant 85 with expression of type 'svtype' is always false [-Wtautological-constant-out-of-range-compare]
-- 
Report by Test::Smoke v1.53 build 1374 running on perl 5.14.2
(Reporter v0.050 / Smoker v0.045)




nntp.perl.org: Perl Programming lists via nntp and http.
Comments to Ask Bjørn Hansen at ask@perl.org | Group listing | About