develooper Front page | perl.perl5.porters | Postings from February 2013

Smoke [maint-5.14] v5.14.3-18-gaa489f1 FAIL(XFm) linux 3.5.0-22-generic [debian] (x86_64/8 cpu) {maint_clang}

From:
George Greer
Date:
February 25, 2013 13:46
Subject:
Smoke [maint-5.14] v5.14.3-18-gaa489f1 FAIL(XFm) linux 3.5.0-22-generic [debian] (x86_64/8 cpu) {maint_clang}
Message ID:
201302251345.r1PDjogx018746@m-l.org
Smoke logs available at http://m-l.org/~perl/smoke/perl/linux/maint_clang/logaa489f198c5a1d90ce4dde17566ccbb61c7eb942.log.gz

Automated smoke report for 5.14.4 patch aa489f198c5a1d90ce4dde17566ccbb61c7eb942 v5.14.3-18-gaa489f1
zwei: Intel(R) Core(TM) i7 CPU 920 @ 2.67GHz (GenuineIntel 2668MHz) (x86_64/8 cpu)
    on        linux - 3.5.0-22-generic [debian]
    using     clang version 4.2.1 Compatible Clang 3.3 (trunk 168545)
    smoketime 13 hours 59 minutes (average 34 minutes 59 seconds)

Summary: FAIL(XFm)

O = OK  F = Failure(s), extended report at the bottom
X = Failure(s) under TEST but not under harness
? = still running or test results not (yet) available
Build failures during:       - = unknown or N/A
c = Configure, m = make, M = make (after miniperl), t = make test-prep

v5.14.3-18-gaa489f1  Configuration (common) -Dcc=clang
----------- ---------------------------------------------------------
O O O O O O 
O O O O O O -Accflags=-DPERL_POISON
m - - m - - -Duse64bitall -Accflags=-DPERL_GLOBAL_STRUCT
m - - m - - -Dusemorebits -Accflags=-DPERL_GLOBAL_STRUCT_PRIVATE
O O O O O F -Dmad
X X X X X X -Accflags=-DPERL_OLD_COPY_ON_WRITE
O O O O O O -Duseithreads
O O O O O O -Duseithreads -Accflags=-DPERL_POISON
m - - m - - -Duseithreads -Duse64bitall -Accflags=-DPERL_GLOBAL_STRUCT
m - - m - - -Duseithreads -Dusemorebits -Accflags=-DPERL_GLOBAL_STRUCT_PRIVATE
O O O O O O -Duseithreads -Dmad
X X X X X X -Duseithreads -Accflags=-DPERL_OLD_COPY_ON_WRITE
| | | | | +- LC_ALL = en_US.utf8 -DDEBUGGING
| | | | +--- PERLIO = perlio -DDEBUGGING
| | | +----- PERLIO = stdio  -DDEBUGGING
| | +------- LC_ALL = en_US.utf8
| +--------- PERLIO = perlio
+----------- PERLIO = stdio 

Locally applied patches:
    SMOKEaa489f198c5a1d90ce4dde17566ccbb61c7eb942

Failures: (common-args) -Dcc=clang
[en_US.utf8] -DDEBUGGING -Dmad
    ../t/op/runlevel.t..........................................FAILED
        9
    ../lib/warnings.t...........................................FAILED
        245

[stdio/perlio/en_US.utf8] -Accflags=-DPERL_OLD_COPY_ON_WRITE
[perlio/en_US.utf8] -DDEBUGGING -Accflags=-DPERL_OLD_COPY_ON_WRITE
Inconsistent test results (between TEST and harness):
    ../t/cpan/Compress-Raw-Zlib/t/07bufsize.tFAILED--expected 288 tests, saw 41
    ../ext/Devel-Peek/t/Peek.t..............FAILED at test 29
    ../t/lib/universal.t....................FAILED--expected 5 tests, saw 3

[stdio] -DDEBUGGING -Accflags=-DPERL_OLD_COPY_ON_WRITE
Inconsistent test results (between TEST and harness):
    ../t/cpan/Compress-Raw-Zlib/t/07bufsize.tFAILED--expected 288 tests, saw 41
    ../ext/Devel-Peek/t/Peek.t..............FAILED at test 29
    ../t/lib/universal.t....................FAILED--expected 5 tests, saw 4

[stdio/perlio/en_US.utf8] -Duseithreads -Accflags=-DPERL_OLD_COPY_ON_WRITE
Inconsistent test results (between TEST and harness):
    ../t/cpan/Compress-Raw-Zlib/t/07bufsize.tFAILED--expected 288 tests, saw 41
    ../t/op/reset.t.........................FAILED--non-zero wait status: 139
    ../ext/Devel-Peek/t/Peek.t..............FAILED at test 29
    ../t/re/pat_rt_report_thr.t.............FAILED--non-zero wait status: 139
    ../t/lib/universal.t....................FAILED--expected 5 tests, saw 3
    ../lib/warnings.t.......................FAILED at test 661

[stdio] -DDEBUGGING -Duseithreads -Accflags=-DPERL_OLD_COPY_ON_WRITE
Inconsistent test results (between TEST and harness):
    ../t/cpan/Compress-Raw-Zlib/t/07bufsize.tFAILED--expected 288 tests, saw 41
    ../t/op/reset.t.........................FAILED--non-zero wait status: 134
    ../ext/Devel-Peek/t/Peek.t..............FAILED at test 29
    ../t/re/pat_rt_report.t.................FAILED--non-zero wait status: 134
    ../t/re/pat_rt_report_thr.t.............FAILED--non-zero wait status: 134
    ../t/lib/universal.t....................FAILED--expected 5 tests, saw 4
    ../lib/warnings.t.......................FAILED at test 661

[perlio/en_US.utf8] -DDEBUGGING -Duseithreads -Accflags=-DPERL_OLD_COPY_ON_WRITE
Inconsistent test results (between TEST and harness):
    ../t/cpan/Compress-Raw-Zlib/t/07bufsize.tFAILED--expected 288 tests, saw 41
    ../t/op/reset.t.........................FAILED--non-zero wait status: 134
    ../ext/Devel-Peek/t/Peek.t..............FAILED at test 29
    ../t/re/pat_rt_report.t.................FAILED--non-zero wait status: 134
    ../t/re/pat_rt_report_thr.t.............FAILED--non-zero wait status: 134
    ../t/lib/universal.t....................FAILED--expected 5 tests, saw 3
    ../lib/warnings.t.......................FAILED at test 661

Compiler messages(gcc):
regcomp.c:4584:22: warning: variable 'plen' is uninitialized when used here [-Wuninitialized]
mro.c:589:21: warning: expression result unused [-Wunused-value]
mro.c:634:2: warning: expression result unused [-Wunused-value]
dump.c:461:57: warning: comparison of constant 85 with expression of type 'svtype' is always false [-Wtautological-constant-out-of-range-compare]
hv.c:343:20: warning: comparison of constant 255 with expression of type 'svtype' is always false [-Wtautological-constant-out-of-range-compare]
util.c:559:5: warning: expression result unused [-Wunused-value]
pp_hot.c:143:3: warning: expression result unused [-Wunused-value]
pp_ctl.c:389:2: warning: expression result unused [-Wunused-value]
toke.c:2185:3: warning: expression result unused [-Wunused-value]
util.c:2619:5: warning: expression result unused [-Wunused-value]
util.c:2786:5: warning: expression result unused [-Wunused-value]
pp_hot.c:1233:5: warning: expression result unused [-Wunused-value]
doop.c:691:5: warning: expression result unused [-Wunused-value]
pp_hot.c:1659:2: warning: expression result unused [-Wunused-value]
scope.c:688:13: warning: format specifies type 'long' but the argument has type 'I32' (aka 'int') [-Wformat]
scope.c:688:19: warning: format specifies type 'long' but the argument has type 'I32' (aka 'int') [-Wformat]
perl.c:364:6: warning: expression result unused [-Wunused-value]
toke.c:3836:5: warning: expression result unused [-Wunused-value]
doio.c:634:17: warning: expression result unused [-Wunused-value]
doio.c:638:17: warning: expression result unused [-Wunused-value]
sv.c:2769:3: warning: expression result unused [-Wunused-value]
sv.c:3671:6: warning: expression result unused [-Wunused-value]
sv.c:4106:6: warning: expression result unused [-Wunused-value]
sv.c:4108:6: warning: expression result unused [-Wunused-value]
pp_sys.c:1723:2: warning: expression result unused [-Wunused-value]
sv.c:4519:5: warning: expression result unused [-Wunused-value]
sv.c:4569:5: warning: expression result unused [-Wunused-value]
sv.c:4624:5: warning: expression result unused [-Wunused-value]
perlio.c:5509:21: warning: comparison of integers of different signs: 'size_t' (aka 'unsigned long') and 'int' [-Wsign-compare]
sv.c:5159:5: warning: expression result unused [-Wunused-value]
toke.c:4796:17: warning: comparison of integers of different signs: 'IV' (aka 'long') and 'STRLEN' (aka 'unsigned long') [-Wsign-compare]
pp_ctl.c:5252:5: warning: expression result unused [-Wunused-value]
pp.c:3759:5: warning: expression result unused [-Wunused-value]
sv.c:7591:5: warning: expression result unused [-Wunused-value]
pp.c:4132:2: warning: expression result unused [-Wunused-value]
pp.c:4270:2: warning: expression result unused [-Wunused-value]
pp.c:4533:2: warning: expression result unused [-Wunused-value]
pp.c:4724:2: warning: expression result unused [-Wunused-value]
sv.c:8725:21: warning: comparison of constant 255 with expression of type 'svtype' is always false [-Wtautological-constant-out-of-range-compare]
sv.c:9083:6: warning: expression result unused [-Wunused-value]
op.c:7581:5: warning: expression result unused [-Wunused-value]
sv.c:9453:5: warning: expression result unused [-Wunused-value]
op.c:9489:4: warning: expression result unused [-Wunused-value]
./const-c.inc:47:2: warning: expression result unused [-Wunused-value]
./const-c.inc:81:5: warning: expression result unused [-Wunused-value]
Call.xs:63:11: warning: format specifies type 'int' but the argument has type 'STRLEN' (aka 'unsigned long') [-Wformat]
Call.xs:63:31: warning: format specifies type 'int' but the argument has type 'STRLEN' (aka 'unsigned long') [-Wformat]
Call.xs:100:13: warning: format specifies type 'int' but the argument has type 'STRLEN' (aka 'unsigned long') [-Wformat]
Call.xs:156:11: warning: format specifies type 'int' but the argument has type 'STRLEN' (aka 'unsigned long') [-Wformat]
Call.xs:175:14: warning: format specifies type 'int' but the argument has type 'STRLEN' (aka 'unsigned long') [-Wformat]
Dumper.xs:817:41: warning: format specifies type 'long' but the argument has type 'U32' (aka 'unsigned int') [-Wformat]
Bzip2.xs:326:5: warning: expression result unused [-Wunused-value]
Zlib.xs:593:5: warning: expression result unused [-Wunused-value]
Storable.xs:4098:2: warning: null passed to a callee which requires a non-null argument [-Wnonnull]
Storable.xs:4531:2: warning: expression result unused [-Wunused-value]
Storable.xs:5503:2: warning: null passed to a callee which requires a non-null argument [-Wnonnull]
Storable.xs:5566:2: warning: null passed to a callee which requires a non-null argument [-Wnonnull]
Storable.xs:6077:5: warning: expression result unused [-Wunused-value]
./const-c.inc:38:2: warning: expression result unused [-Wunused-value]
./const-c.inc:73:5: warning: expression result unused [-Wunused-value]
scalar.xs:48:5: warning: expression result unused [-Wunused-value]
./const-c.inc:72:5: warning: expression result unused [-Wunused-value]
Socket.xs:227:2: warning: expression result unused [-Wunused-value]
Socket.xs:461:9: warning: format specifies type 'int' but the argument has type 'STRLEN' (aka 'unsigned long') [-Wformat]
Socket.xs:461:18: warning: format specifies type 'int' but the argument has type 'unsigned long' [-Wformat]
Socket.xs:482:39: warning: format specifies type 'int' but the argument has type 'STRLEN' (aka 'unsigned long') [-Wformat]
Socket.xs:483:5: warning: format specifies type 'int' but the argument has type 'unsigned long' [-Wformat]
Socket.xs:620:9: warning: format specifies type 'int' but the argument has type 'STRLEN' (aka 'unsigned long') [-Wformat]
Socket.xs:620:18: warning: format specifies type 'int' but the argument has type 'unsigned long' [-Wformat]
Socket.xs:644:4: warning: format specifies type 'int' but the argument has type 'STRLEN' (aka 'unsigned long') [-Wformat]
Socket.xs:644:17: warning: format specifies type 'int' but the argument has type 'unsigned long' [-Wformat]
Socket.xs:678:34: warning: format specifies type 'int' but the argument has type 'STRLEN' (aka 'unsigned long') [-Wformat]
Socket.xs:678:43: warning: format specifies type 'int' but the argument has type 'unsigned long' [-Wformat]
Socket.xs:712:7: warning: format specifies type 'int' but the argument has type 'STRLEN' (aka 'unsigned long') [-Wformat]
Socket.xs:712:16: warning: format specifies type 'int' but the argument has type 'unsigned long' [-Wformat]
Collate.xs:587:2: warning: expression result unused [-Wunused-value]
Collate.xs:578:2: warning: expression result unused [-Wunused-value]
ExtTest.xs:44:2: warning: expression result unused [-Wunused-value]
ExtTest.xs:78:5: warning: expression result unused [-Wunused-value]
sv.c:416:21: warning: comparison of constant 255 with expression of type 'svtype' is always true [-Wtautological-constant-out-of-range-compare]
sv.c:435:20: warning: comparison of constant 255 with expression of type 'svtype' is always true [-Wtautological-constant-out-of-range-compare]
sv.c:6059:20: warning: comparison of constant 255 with expression of type 'svtype' is always true [-Wtautological-constant-out-of-range-compare]
./sv.h:290doop.c:691:5: warning: expression result unused [-Wunused-value]
mg.c:487:10: error: use of undeclared identifier 'my_vars'
mg.c:494:8: error: use of undeclared identifier 'my_vars'
./dquote_static.c:25:10: error: use of undeclared identifier 'my_vars'
./dquote_static.c:31:9: error: use of undeclared identifier 'my_vars'
./dquote_static.c:59:14: error: use of undeclared identifier 'my_vars'
./dquote_static.c:64:16: error: use of undeclared identifier 'my_vars'
./dquote_static.c:72:12: error: use of undeclared identifier 'my_vars'
toke.c:1471:13: error: use of undeclared identifier 'my_vars'
hv.c:838:6: error: use of undeclared identifier 'my_vars'
util.c:4459:15: error: use of undeclared identifier 'my_vars'
util.c:4464:6: error: use of undeclared identifier 'my_vars'
./dquote_static.c:27:12: error: use of undeclared identifier 'my_vars'
doio.c:1099:32: error: use of undeclared identifier 'my_vars'
util.c:4473:31: error: use of undeclared identifier 'my_vars'
util.c:4478:9: error: use of undeclared identifier 'my_vars'
doio.c:1109:32: error: use of undeclared identifier 'my_vars'
doio.c:1121:15: error: use of undeclared identifier 'my_vars'
util.c:4500:13: error: use of undeclared identifier 'my_vars'
util.c:4502:10: error: use of undeclared identifier 'my_vars'
util.c:4526:13: error: use of undeclared identifier 'my_vars'
util.c:4545:23: error: use of undeclared identifier 'my_vars'
util.c:4551:9: error: use of undeclared identifier 'my_vars'
gv.c:2612:8: error: use of undeclared identifier 'my_vars'
util.c:4560:31: error: use of undeclared identifier 'my_vars'
numeric.c:575:22: error: use of undeclared identifier 'my_vars'
pp_pack.c:930:6: error: use of undeclared identifier 'my_vars'
util.c:4577:15: error: use of undeclared identifier 'my_vars'
pp_pack.c:960:10: error: use of undeclared identifier 'my_vars'
dump.c:301:46: error: use of undeclared identifier 'my_vars'
numeric.c:590:7: error: use of undeclared identifier 'my_vars'
pp_pack.c:983:9: error: use of undeclared identifier 'my_vars'
util.c:4591:7: error: use of undeclared identifier 'my_vars'
numeric.c:652:62: error: use of undeclared identifier 'my_vars'
utf8.c:2305:9: error: use of undeclared identifier 'my_vars'
util.c:4591:56: error: use of undeclared identifier 'my_vars'
pp_pack.c:1007:13: error: use of undeclared identifier 'my_vars'
dump.c:324:44: error: use of undeclared identifier 'my_vars'
toke.c:8819:13: error: use of undeclared identifier 'my_vars'
utf8.c:2318:10: error: use of undeclared identifier 'my_vars'
toke.c:8849:39: error: use of undeclared identifier 'my_vars'
pp_pack.c:1079:6: error: use of undeclared identifier 'my_vars'
numeric.c:681:26: error: use of undeclared identifier 'my_vars'
util.c:4596:9: error: use of undeclared identifier 'my_vars'
pp_pack.c:1092:15: error: use of undeclared identifier 'my_vars'
numeric.c:688:21: error: use of undeclared identifier 'my_vars'
util.c:4598:23: error: use of undeclared identifier 'my_vars'
pp_pack.c:1111:15: error: use of undeclared identifier 'my_vars'
util.c:4616:10: error: use of undeclared identifier 'my_vars'
numeric.c:734:23: error: use of undeclared identifier 'my_vars'
utf8.c:2999:51: error: use of undeclared identifier 'my_vars'
toke.c:11306:7: error: use of undeclared identifier 'my_vars'
util.c:4626:12: error: use of undeclared identifier 'my_vars'
toke.c:11310:10: error: use of undeclared identifier 'my_vars'
numeric.c:737:30: error: use of undeclared identifier 'my_vars'
util.c:4629:10: error: use of undeclared identifier 'my_vars'
numeric.c:743:22: error: use of undeclared identifier 'my_vars'
numeric.c:903:12: error: use of undeclared identifier 'my_vars'
util.c:4689:12: error: use of undeclared identifier 'my_vars'
numeric.c:934:6: error: use of undeclared identifier 'my_vars'
numeric.c:961:10: error: use of undeclared identifier 'my_vars'
numeric.c:987:12: error: use of undeclared identifier 'my_vars'
numeric.c:1012:9: error: use of undeclared identifier 'my_vars'
regcomp.c:5740:9: error: use of undeclared identifier 'my_vars'
regcomp.c:5749:15: error: use of undeclared identifier 'my_vars'
op.c:2125:21: error: use of undeclared identifier 'my_vars'
op.c:2122:16: error: use of undeclared identifier 'my_vars'
regcomp.c:9025:6: error: use of undeclared identifier 'my_vars'
regcomp.c:9319:9: error: use of undeclared identifier 'my_vars'
regcomp.c:10478:10: error: use of undeclared identifier 'my_vars'
perl.c:2967:9: error: use of undeclared identifier 'my_vars'
perl.c:2971:9: error: use of undeclared identifier 'my_vars'
perl.c:2982:9: error: use of undeclared identifier 'my_vars'
numeric.c:691:28: error: use of undeclared identifier 'my_vars'
pp_pack.c:1124:20: error: use of undeclared identifier 'my_vars'
./handy.hop.c:7581:5: warning: expression result unused [-Wunused-value]
regcomp.c:11904:10: error: use of undeclared identifier 'my_vars'
util.c:4459:15: error: use117:32: note: expanded from macro 'cBOOL'
./handy.h:numeric.c:590:7: error: use of undeclared identifier 'my_vars'
op.c:#def:4: warning: expression result unused [-Wunused-value]
./embedvar.h:718:24: numeric.c:734:23: error: use of undeclared identifier 'my_vars'
perl.c:2980:14: error: use of undeclared identifier 'my_vars'
dump.c:2696:57: warning: comparison of constant 85 with expression of type 'svtype' is always false [-Wtautological-constant-out-of-range-compare]
sv.c:4466:2: warning: expression result unused [-Wunused-value]
sv.c:4445:5: warning: expression result unused [-Wunused-value]
regcomp.c:4525:16: note: initialize the variable 'plen' to silence this warningsv.c:4519:5: warning: expression result unused [-Wunused-value]    STRLEN plen;
sv.c:4684:53: warning: unused parameter 'pvx' [-Wunused-parameter]
sv.c:11765:22: warning: comparison of constant 255 with expression of type 'svtype' is always false [-Wtautological-constant-out-of-range-compare]
sv.c:4624:5:pp.c:4533:2: warning: expression result unused [-Wunused-value]
Call.xs 156:11: warning: format specifies type 'int' but the argument has type 'STRLEN' (aka 'unsigned long') [-Wformat]
hv.c:3402:2: error: use of undeclared identifier 'my_vars'
hv.c:3404:2: error: use of undeclared identifier 'my_vars'
./handy.h:752numeric.c:903:12: error: use of undeclared identifier 'my_vars'
#   defin:1012:9: error: ./handy.h:639:54: note: expanded from macro 'isSPACE_A'
#defin:4526:13: error: use of undeclared identifier 'my_vars'./handy.h:117:32: note: expanded from macro 'cBOOL'
./embedvar.h:718:24: util.c:4545:23: error: use of undeclared identifier 'my_vars'
numeri:1475:13: error: uerror: use of undeclared identifier 'my_vars'
utf8.c:2305:9: sv.c:3671:6: warning: expression result unused [-Wunused-value]
:1723:2: warning: expression result unused [-Wunused-value]
pp.c:4533:2: warning: expression result unused [-Wunused-value]regcomp.c:9319:9: error: use of undeclared identifier 'my_vars'
util.c#2786:5: warning: expression result unused [-Wunused-value]
^~~~~~~~~~~~~~~~~~~~~~~Socket.xs:712:7: warning: format specifies type 'int' but the argument has type 'STRLEN' (aka 'unsigned long') [-Wformat]
const int val = my_vsnprintf(s, n > 0 ? n : 0, fmt, ap);sv.c:2769:3: warning: expression result unused [-Wunused-value]
../../sv.h:Socket.xs:678:34: warning: format specifies type 'int' but the argument has type 'STRLEN' (aka 'unsigned long') [-Wformat]
-- 
Report by Test::Smoke v1.53 build 1374 running on perl 5.14.2
(Reporter v0.050 / Smoker v0.045)




nntp.perl.org: Perl Programming lists via nntp and http.
Comments to Ask Bjørn Hansen at ask@perl.org | Group listing | About