develooper Front page | perl.perl5.porters | Postings from February 2013

Smoke [maint-5.14] v5.14.3-18-gaa489f1 FAIL(XFm) linux 3.5.0-22-generic [debian] (x86_64/8 cpu) {maint_g++}

From:
George Greer
Date:
February 25, 2013 13:01
Subject:
Smoke [maint-5.14] v5.14.3-18-gaa489f1 FAIL(XFm) linux 3.5.0-22-generic [debian] (x86_64/8 cpu) {maint_g++}
Message ID:
201302251300.r1PD0oKI016547@m-l.org
Smoke logs available at http://m-l.org/~perl/smoke/perl/linux/maint_g++/logaa489f198c5a1d90ce4dde17566ccbb61c7eb942.log.gz

Automated smoke report for 5.14.4 patch aa489f198c5a1d90ce4dde17566ccbb61c7eb942 v5.14.3-18-gaa489f1
zwei: Intel(R) Core(TM) i7 CPU 920 @ 2.67GHz (GenuineIntel 2668MHz) (x86_64/8 cpu)
    on        linux - 3.5.0-22-generic [debian]
    using     g++ version 4.7.2
    smoketime 13 hours 15 minutes (average 33 minutes 10 seconds)

Summary: FAIL(XFm)

O = OK  F = Failure(s), extended report at the bottom
X = Failure(s) under TEST but not under harness
? = still running or test results not (yet) available
Build failures during:       - = unknown or N/A
c = Configure, m = make, M = make (after miniperl), t = make test-prep

v5.14.3-18-gaa489f1  Configuration (common) -Dcc=g++
----------- ---------------------------------------------------------
O O O O X O 
O O O O O O -Accflags=-DPERL_POISON
m - - m - - -Duse64bitall -Accflags=-DPERL_GLOBAL_STRUCT_PRIVATE
m - - m - - -Dusemorebits -Accflags=-DPERL_GLOBAL_STRUCT
O O O O O F -Dmad
X X X X X X -Accflags=-DPERL_OLD_COPY_ON_WRITE
O O O O O O -Duseithreads
O O O O O O -Duseithreads -Accflags=-DPERL_POISON
m - - m - - -Duseithreads -Duse64bitall -Accflags=-DPERL_GLOBAL_STRUCT_PRIVATE
m - - m - - -Duseithreads -Dusemorebits -Accflags=-DPERL_GLOBAL_STRUCT
O O O O O O -Duseithreads -Dmad
X X X X X X -Duseithreads -Accflags=-DPERL_OLD_COPY_ON_WRITE
| | | | | +- LC_ALL = en_US.utf8 -DDEBUGGING
| | | | +--- PERLIO = perlio -DDEBUGGING
| | | +----- PERLIO = stdio  -DDEBUGGING
| | +------- LC_ALL = en_US.utf8
| +--------- PERLIO = perlio
+----------- PERLIO = stdio 

Locally applied patches:
    SMOKEaa489f198c5a1d90ce4dde17566ccbb61c7eb942

Failures: (common-args) -Dcc=g++
[perlio] -DDEBUGGING
Inconsistent test results (between TEST and harness):
    ../lib/Benchmark.t......................FAILED at test 15

[en_US.utf8] -DDEBUGGING -Dmad
    ../t/op/runlevel.t..........................................FAILED
        9
    ../lib/warnings.t...........................................FAILED
        245

[stdio/perlio/en_US.utf8] -Accflags=-DPERL_OLD_COPY_ON_WRITE
[perlio/en_US.utf8] -DDEBUGGING -Accflags=-DPERL_OLD_COPY_ON_WRITE
Inconsistent test results (between TEST and harness):
    ../t/cpan/Compress-Raw-Zlib/t/07bufsize.tFAILED--expected 288 tests, saw 41
    ../ext/Devel-Peek/t/Peek.t..............FAILED at test 29
    ../t/lib/universal.t....................FAILED--expected 5 tests, saw 3

[stdio] -DDEBUGGING -Accflags=-DPERL_OLD_COPY_ON_WRITE
Inconsistent test results (between TEST and harness):
    ../t/cpan/Compress-Raw-Zlib/t/07bufsize.tFAILED--expected 288 tests, saw 41
    ../ext/Devel-Peek/t/Peek.t..............FAILED at test 29
    ../t/lib/universal.t....................FAILED--expected 5 tests, saw 4

[stdio/perlio/en_US.utf8] -Duseithreads -Accflags=-DPERL_OLD_COPY_ON_WRITE
Inconsistent test results (between TEST and harness):
    ../t/cpan/Compress-Raw-Zlib/t/07bufsize.tFAILED--expected 288 tests, saw 41
    ../t/op/reset.t.........................FAILED--non-zero wait status: 139
    ../ext/Devel-Peek/t/Peek.t..............FAILED at test 29
    ../t/re/pat_rt_report_thr.t.............FAILED--non-zero wait status: 139
    ../t/lib/universal.t....................FAILED--expected 5 tests, saw 3
    ../lib/warnings.t.......................FAILED at test 661

[stdio] -DDEBUGGING -Duseithreads -Accflags=-DPERL_OLD_COPY_ON_WRITE
Inconsistent test results (between TEST and harness):
    ../t/cpan/Compress-Raw-Zlib/t/07bufsize.tFAILED--expected 288 tests, saw 41
    ../lib/Benchmark.t......................FAILED at test 15
    ../t/op/reset.t.........................FAILED--non-zero wait status: 134
    ../ext/Devel-Peek/t/Peek.t..............FAILED at test 29
    ../t/re/pat_rt_report.t.................FAILED--non-zero wait status: 134
    ../t/re/pat_rt_report_thr.t.............FAILED--non-zero wait status: 134
    ../t/lib/universal.t....................FAILED--expected 5 tests, saw 4
    ../lib/warnings.t.......................FAILED at test 661

[perlio/en_US.utf8] -DDEBUGGING -Duseithreads -Accflags=-DPERL_OLD_COPY_ON_WRITE
Inconsistent test results (between TEST and harness):
    ../t/cpan/Compress-Raw-Zlib/t/07bufsize.tFAILED--expected 288 tests, saw 41
    ../t/op/reset.t.........................FAILED--non-zero wait status: 134
    ../ext/Devel-Peek/t/Peek.t..............FAILED at test 29
    ../t/re/pat_rt_report.t.................FAILED--non-zero wait status: 134
    ../t/re/pat_rt_report_thr.t.............FAILED--non-zero wait status: 134
    ../t/lib/universal.t....................FAILED--expected 5 tests, saw 3
    ../lib/warnings.t.......................FAILED at test 661

Compiler messages(gcc):
try.c: In function ‘int main()’:
util.c: In function ‘void* Perl_safesyscalloc(size_t, size_t)’:
util.c:297:14: warning: variable ‘total_size’ set but not used [-Wunused-but-set-variable]
util.c: In function ‘char* S_write_no_mem()’:
util.c:72:34: warning: ignoring return value of ‘ssize_t write(int, const void*, size_t)’, declared with attribute warn_unused_result [-Wunused-result]
regexec.c: In function ‘char* S_find_byclass(regexp*, const regnode*, char*, const char*, regmatch_info*)’:
regexec.c:1530:6: warning: variable ‘ok’ set but not used [-Wunused-but-set-variable]
regexec.c:1536:6: warning: variable ‘ok’ set but not used [-Wunused-but-set-variable]
regexec.c:1541:6: warning: variable ‘ok’ set but not used [-Wunused-but-set-variable]
regexec.c:1551:6: warning: variable ‘ok’ set but not used [-Wunused-but-set-variable]
regexec.c:1561:6: warning: variable ‘ok’ set but not used [-Wunused-but-set-variable]
regexec.c:1566:6: warning: variable ‘ok’ set but not used [-Wunused-but-set-variable]
regexec.c:1577:6: warning: variable ‘ok’ set but not used [-Wunused-but-set-variable]
regexec.c:1584:6: warning: variable ‘ok’ set but not used [-Wunused-but-set-variable]
regexec.c:1596:6: warning: variable ‘ok’ set but not used [-Wunused-but-set-variable]
regexec.c:1603:6: warning: variable ‘ok’ set but not used [-Wunused-but-set-variable]
regexec.c:1622:6: warning: variable ‘ok’ set but not used [-Wunused-but-set-variable]
regexec.c:1629:6: warning: variable ‘ok’ set but not used [-Wunused-but-set-variable]
regexec.c:1647:6: warning: variable ‘ok’ set but not used [-Wunused-but-set-variable]
regexec.c:1654:6: warning: variable ‘ok’ set but not used [-Wunused-but-set-variable]
regexec.c:1673:6: warning: variable ‘ok’ set but not used [-Wunused-but-set-variable]
regexec.c:1691:6: warning: variable ‘ok’ set but not used [-Wunused-but-set-variable]
regexec.c:1394:9: warning: variable ‘lnc’ set but not used [-Wunused-but-set-variable]
regexec.c: In function ‘I32 S_regmatch(regmatch_info*, regnode*)’:
regexec.c:3680:7: warning: variable ‘ok’ set but not used [-Wunused-but-set-variable]
regexec.c:3756:9: warning: variable ‘ok’ set but not used [-Wunused-but-set-variable]
regexec.c:3760:1: warning: variable ‘ok’ set but not used [-Wunused-but-set-variable]
regexec.c:3762:9: warning: variable ‘ok’ set but not used [-Wunused-but-set-variable]
regexec.c:3766:1: warning: variable ‘ok’ set but not used [-Wunused-but-set-variable]
regexec.c:3768:9: warning: variable ‘ok’ set but not used [-Wunused-but-set-variable]
regexec.c:3771:1: warning: variable ‘ok’ set but not used [-Wunused-but-set-variable]
regexec.c:3855:7: warning: variable ‘ok’ set but not used [-Wunused-but-set-variable]
regexec.c:3855:1: warning: variable ‘ok’ set but not used [-Wunused-but-set-variable]
regexec.c:3855:1: warning: variable ‘throw_away’ set but not used [-Wunused-but-set-variable]
regexec.c: In function ‘I32 S_regrepeat(const regexp*, const regnode*, I32, int)’:
regexec.c:6038:6: warning: variable ‘ok’ set but not used [-Wunused-but-set-variable]
regexec.c:6083:6: warning: variable ‘ok’ set but not used [-Wunused-but-set-variable]
regexec.c:6135:6: warning: variable ‘ok’ set but not used [-Wunused-but-set-variable]
regexec.c:6184:6: warning: variable ‘ok’ set but not used [-Wunused-but-set-variable]
regexec.c:6237:6: warning: variable ‘ok’ set but not used [-Wunused-but-set-variable]
regexec.c:6270:6: warning: variable ‘ok’ set but not used [-Wunused-but-set-variable]
hv.c: In function ‘SV* S_hv_delete_common(HV*, SV*, const char*, STRLEN, int, I32, U32)’:
hv.c:907:16: warning: variable ‘first_entry’ set but not used [-Wunused-but-set-variable]
hv.c: In function ‘void S_clear_placeholders(HV*, U32)’:
hv.c:1619:7: warning: variable ‘first’ set but not used [-Wunused-but-set-variable]
toke.c: In function ‘int Perl_yylex()’:
toke.c:4796:20: warning: comparison between signed and unsigned integer expressions [-Wsign-compare]
hv.c: In function ‘void S_unshare_hek_or_pvn(const HEK*, const char*, I32, U32)’:
hv.c:2649:10: warning: variable ‘first’ set but not used [-Wunused-but-set-variable]
dump.c:1575:1: warning: narrowing conversion of ‘-2147483648’ from ‘int’ to ‘U32 {aka unsigned int}’ inside { } is ill-formed in C++11 [-Wnarrowing]
pp_sys.c: In function ‘OP* Perl_pp_warn()’:
pp_sys.c:422:17: warning: variable ‘pv’ set but not used [-Wunused-but-set-variable]
pp_sys.c: In function ‘OP* Perl_pp_die()’:
pp_sys.c:462:17: warning: variable ‘pv’ set but not used [-Wunused-but-set-variable]
doio.c: In function ‘void S_exec_failed(const char*, int, int)’:
doio.c:1383:43: warning: ignoring return value of ‘ssize_t write(int, const void*, size_t)’, declared with attribute warn_unused_result [-Wunused-result]
pp_ctl.c: In function ‘OP* Perl_pp_goto()’:
pp_ctl.c:2701:8: warning: variable ‘newsp’ set but not used [-Wunused-but-set-variable]
pp_ctl.c:2702:7: warning: variable ‘gimme’ set but not used [-Wunused-but-set-variable]
doio.c: In function ‘PerlIOl** Perl_nextargv(GV*)’:
doio.c:871:46: warning: ignoring return value of ‘int fchown(int, __uid_t, __gid_t)’, declared with attribute warn_unused_result [-Wunused-result]
sv.c: In function ‘void Perl_sv_vcatpvfn(SV*, const char*, STRLEN, __va_list_tag (*)[1], SV**, I32, bool*)’:
sv.c:10052:41: warning: ignoring return value of ‘char* gcvt(double, int, char*)’, declared with attribute warn_unused_result [-Wunused-result]
sv.c:10890:53: warning: ignoring return value of ‘char* gcvt(double, int, char*)’, declared with attribute warn_unused_result [-Wunused-result]
sv.c: In function ‘char* Perl_sv_2pv_flags(SV*, STRLEN*, I32)’:
sv.c:2762:39: warning: ignoring return value of ‘char* gcvt(double, int, char*)’, declared with attribute warn_unused_result [-Wunused-result]
sv.c:2951:39: warning: ignoring return value of ‘char* gcvt(double, int, char*)’, declared with attribute warn_unused_result [-Wunused-result]
pp_ctl.c: In function ‘OP* Perl_pp_leavewhen()’:
pp_ctl.c:4857:9: warning: variable ‘gimme’ set but not used [-Wunused-but-set-variable]
perlio.c: In function ‘void S_more_refcounted_fds(int)’:
perlio.c:2378:38: warning: ignoring return value of ‘ssize_t write(int, const void*, size_t)’, declared with attribute warn_unused_result [-Wunused-result]
perlio.c: In function ‘void PerlIO_debug(const char*, ...)’:
perlio.c:519:43: warning: ignoring return value of ‘ssize_t write(int, const void*, size_t)’, declared with attribute warn_unused_result [-Wunused-result]
regcomp.c: In function ‘regnode* S_regpiece(RExC_state_t*, I32*, U32)’:
regcomp.c:7429:11: warning: variable ‘parse_start’ set but not used [-Wunused-but-set-variable]
Dumper.xs: In function ‘I32 DD_dump(SV*, const char*, STRLEN, SV*, HV*, AV*, I32*, I32, SV*, SV*, SV*, SV*, SV*, SV*, SV*, I32, I32, I32, SV*, I32, SV*)’:
Dumper.xs:817:49: warning: format ‘%ld’ expects argument of type ‘long int’, but argument 2 has type ‘U32 {aka unsigned int}’ [-Wformat]
Call.xs:100:41: warning: format ‘%d’ expects argument of type ‘int’, but argument 4 has type ‘STRLEN {aka long unsigned int}’ [-Wformat]
Call.xs:156:38: warning: format ‘%d’ expects argument of type ‘int’, but argument 3 has type ‘STRLEN {aka long unsigned int}’ [-Wformat]
Call.xs:175:51: warning: format ‘%d’ expects argument of type ‘int’, but argument 4 has type ‘long unsigned int’ [-Wformat]
sdbm.c: In function ‘int makroom(DBM*, long int, int)’:
sdbm.c:371:70: warning: ignoring return value of ‘ssize_t write(int, const void*, size_t)’, declared with attribute warn_unused_result [-Wunused-result]
Collate.xs: In function ‘void XS_Unicode__Collate_getHST(CV*)’:
Collate.xs:257:17: warning: deprecated conversion from string constant to ‘char*’ [-Wwrite-strings]
Collate.xs:259:17: warning: deprecated conversion from string constant to ‘char*’ [-Wwrite-strings]
Collate.xs:263:17: warning: deprecated conversion from string constant to ‘char*’ [-Wwrite-strings]
Collate.xs:265:17: warning: deprecated conversion from string constant to ‘char*’ [-Wwrite-strings]
Collate.xs:267:17: warning: deprecated conversion from string constant to ‘char*’ [-Wwrite-strings]
Collate.xs:269:17: warning: deprecated conversion from string constant to ‘char*’ [-Wwrite-strings]
Collate.xs:274:17: warning: deprecated conversion from string constant to ‘char*’ [-Wwrite-strings]
Collate.xs:277:17: warning: deprecated conversion from string constant to ‘char*’ [-Wwrite-strings]
Collate.xs:280:17: warning: deprecated conversion from string constant to ‘char*’ [-Wwrite-strings]
Collate.xs:282:17: warning: deprecated conversion from string constant to ‘char*’ [-Wwrite-strings]
Collate.xs: In function ‘void XS_Unicode__Collate_visualizeSortKey(CV*)’:
Collate.xs:616:29: warning: deprecated conversion from string constant to ‘char*’ [-Wwrite-strings]
regcomp.c: In function ‘void S_dump_trie(const _reg_trie_data*, HV*, AV*, U32)’:
regcomp.c:1040:5: warning: variable ‘re_debug_flags’ set but not used [-Wunused-but-set-variable]
regcomp.c: In function ‘void S_dump_trie_interim_list(const _reg_trie_data*, HV*, AV*, U32, U32)’:
regcomp.c:1131:5: warning: variable ‘re_debug_flags’ set but not used [-Wunused-but-set-variable]
regcomp.c: In function ‘void S_dump_trie_interim_table(const _reg_trie_data*, HV*, AV*, U32, U32)’:
regcomp.c:1189:5: warning: variable ‘re_debug_flags’ set but not used [-Wunused-but-set-variable]
regcomp.c: In function ‘REGEXP* Perl_re_compile(SV*, U32)’:
regcomp.c:5316:5: warning: variable ‘re_debug_flags’ set but not used [-Wunused-but-set-variable]
regcomp.c: In function ‘SV* Perl_reg_named_buff_nextkey(REGEXP*, U32)’:
regcomp.c:5465:5: warning: variable ‘re_debug_flags’ set but not used [-Wunused-but-set-variable]
regcomp.c: In function ‘void Perl_pregfree2(REGEXP*)’:
regcomp.c:11331:5: warning: variable ‘re_debug_flags’ set but not used [-Wunused-but-set-variable]
Call.xs: In function ‘I32 filter_call(int, SV*, int)’:
Call.xs:63:58: warning: format ‘%d’ expects argument of type ‘int’, but argument 3 has type ‘STRLEN {aka long unsigned int}’ [-Wformat]
Call.xs:63:58: warning: format ‘%d’ expects argument of type ‘int’, but argument 5 has type ‘STRLEN {aka long unsigned int}’ [-Wformat]
mg.c: In function ‘int Perl_mg_copy(PerlInterpreter*, SV*, SV*, const char*, I32)’:
mg.c:487:10: error: ‘my_vars’ was not declared in this scope
gv.c: In function ‘bool Perl_is_gv_magical_sv(PerlInterpreter*, SV*, U32)’:
gv.c:2612:8: error: ‘my_vars’ was not declared in this scope
util.c: In function ‘const char* Perl_prescan_version(PerlInterpreter*, const char*, bool, const char**, bool*, int*, int*, bool*)’:
util.c:4459:15: error: ‘my_vars’ was not declared in this scope
util.c:4464:6: error: ‘my_vars’ was not declared in this scope
util.c:4473:31: error: ‘my_vars’ was not declared in this scope
util.c:4478:9: error: ‘my_vars’ was not declared in this scope
util.c:4500:13: error: ‘my_vars’ was not declared in this scope
util.c:4545:23: error: ‘my_vars’ was not declared in this scope
util.c:4551:9: error: ‘my_vars’ was not declared in this scope
util.c:4560:31: error: ‘my_vars’ was not declared in this scope
util.c:4591:7: error: ‘my_vars’ was not declared in this scope
util.c:4596:9: error: ‘my_vars’ was not declared in this scope
util.c:4626:12: error: ‘my_vars’ was not declared in this scope
util.c:4629:10: error: ‘my_vars’ was not declared in this scope
util.c: In function ‘const char* Perl_scan_version(PerlInterpreter*, const char*, SV*, bool)’:
util.c:4689:12: error: ‘my_vars’ was not declared in this scope
util.c:4712:12: error: ‘my_vars’ was not declared in this scope
util.c:4714:10: error: ‘my_vars’ was not declared in this scope
util.c: In function ‘U32 Perl_parse_unicode_opts(PerlInterpreter*, const char**)’:
util.c:5652:12: error: ‘my_vars’ was not declared in this scope
util.c: In function ‘char* S_write_no_mem(PerlInterpreter*)’:
hv.c: In function ‘void S_hv_magic_check(HV*, bool*, bool*)’:
hv.c:838:6: error: ‘my_vars’ was not declared in this scope
numeric.c: In function ‘int Perl_grok_number(PerlInterpreter*, const char*, STRLEN, UV*)’:
numeric.c:575:22: error: ‘my_vars’ was not declared in this scope
numeric.c:590:7: error: ‘my_vars’ was not declared in this scope
numeric.c:734:23: error: ‘my_vars’ was not declared in this scope
dquote_static.c: In function ‘I32 S_regcurly(PerlInterpreter*, const char*)’:
dquote_static.c:25:10: error: ‘my_vars’ was not declared in this scope
dquote_static.c:27:12: error: ‘my_vars’ was not declared in this scope
dquote_static.c:31:9: error: ‘my_vars’ was not declared in this scope
dquote_static.c: In function ‘char S_grok_bslash_c(PerlInterpreter*, char, bool, bool)’:
dquote_static.c:59:14: error: ‘my_vars’ was not declared in this scope
dump.c: In function ‘char* Perl_pv_escape(PerlInterpreter*, SV*, const char*, STRLEN, STRLEN, STRLEN*, U32)’:
dump.c:301:46: error: ‘my_vars’ was not declared in this scope
doio.c: In function ‘int Perl_mode_from_discipline(PerlInterpreter*, const char*, STRLEN)’:
doio.c:1099:32: error: ‘my_vars’ was not declared in this scope
doio.c:1109:32: error: ‘my_vars’ was not declared in this scope
doio.c:1121:15: error: ‘my_vars’ was not declared in this scope
numeric.c:743:22: error: ‘my_vars’ was not declared in this scope
numeric.c: In function ‘char* Perl_my_atof2(PerlInterpreter*, const char*, NV*)’:
numeric.c:903:12: error: ‘my_vars’ was not declared in this scope
numeric.c:934:6: error: ‘my_vars’ was not declared in this scope
numeric.c:1012:9: error: ‘my_vars’ was not declared in this scope
pp_sys.c: In function ‘OP* Perl_pp_warn(PerlInterpreter*)’:
utf8.c: In function ‘U8* S_swash_scan_list_line(PerlInterpreter*, U8*, U8*, UV*, UV*, UV*, bool, const U8*)’:
utf8.c:2305:9: error: ‘my_vars’ was not declared in this scope
pp_sys.c: In function ‘OP* Perl_pp_die(PerlInterpreter*)’:
utf8.c: In function ‘char* Perl_pv_uni_display(PerlInterpreter*, SV*, const U8*, STRLEN, STRLEN, UV)’:
utf8.c:2999:51: error: ‘my_vars’ was not declared in this scope
regexec.c: In function ‘char* S_find_byclass(PerlInterpreter*, regexp*, const regnode*, char*, const char*, regmatch_info*)’:
toke.c: In function ‘void Perl_lex_read_space(PerlInterpreter*, U32)’:
toke.c:1471:13: error: ‘my_vars’ was not declared in this scope
pp_pack.c: In function ‘const char* S_group_end(PerlInterpreter*, const char*, const char*, char)’:
pp_pack.c:930:6: error: ‘my_vars’ was not declared in this scope
pp_pack.c: In function ‘const char* S_get_num(PerlInterpreter*, const char*, I32*)’:
pp_pack.c:960:10: error: ‘my_vars’ was not declared in this scope
pp_pack.c: In function ‘bool S_next_symbol(PerlInterpreter*, tempsym*)’:
pp_pack.c:983:9: error: ‘my_vars’ was not declared in this scope
doio.c: In function ‘void S_exec_failed(PerlInterpreter*, const char*, int, int)’:
doio.c: In function ‘PerlIOl** Perl_nextargv(PerlInterpreter*, GV*)’:
op.c: In function ‘void Perl_apply_attrs_string(PerlInterpreter*, const char*, CV*, const char*, STRLEN)’:
op.c:2122:16: error: ‘my_vars’ was not declared in this scope
op.c:2125:21: error: ‘my_vars’ was not declared in this scope
toke.c: In function ‘int Perl_yylex(PerlInterpreter*)’:
regexec.c: In function ‘I32 S_regmatch(PerlInterpreter*, regmatch_info*, regnode*)’:
regexec.c:3680:1: warning: variable ‘ok’ set but not used [-Wunused-but-set-variable]
pp_ctl.c: In function ‘OP* Perl_pp_goto(PerlInterpreter*)’:
perlio.c: In function ‘void S_more_refcounted_fds(PerlInterpreter*, int)’:
regexec.c: In function ‘I32 S_regrepeat(PerlInterpreter*, const regexp*, const regnode*, I32, int)’:
regexec.c:6038:1: warning: variable ‘ok’ set but not used [-Wunused-but-set-variable]
regexec.c:6083:1: warning: variable ‘ok’ set but not used [-Wunused-but-set-variable]
regexec.c:6135:1: warning: variable ‘ok’ set but not used [-Wunused-but-set-variable]
pp_ctl.c: In function ‘OP* Perl_pp_leavewhen(PerlInterpreter*)’:
regexec.c:6184:1: warning: variable ‘ok’ set but not used [-Wunused-but-set-variable]
regexec.c:6237:1: warning: variable ‘ok’ set but not used [-Wunused-but-set-variable]
regexec.c:6270:1: warning: variable ‘ok’ set but not used [-Wunused-but-set-variable]
regcomp.c: In function ‘SV* S_reg_scan_name(PerlInterpreter*, RExC_state_t*, U32)’:
regcomp.c:5740:9: error: ‘my_vars’ was not declared in this scope
sv.c: In function ‘void Perl_sv_vcatpvfn(PerlInterpreter*, SV*, const char*, STRLEN, __va_list_tag (*)[1], SV**, I32, bool*)’:
regcomp.c: In function ‘char* S_regwhite(RExC_state_t*, char*)’:
regcomp.c:9025:6: error: ‘my_vars’ was not declared in this scope
regcomp.c: In function ‘U8 S_set_regclass_bit_fold(PerlInterpreter*, RExC_state_t*, regnode*, U8, HV**, AV**)’:
regcomp.c:9319:9: error: ‘my_vars’ was not declared in this scope
toke.c: In function ‘bool S_pmflag(PerlInterpreter*, const char*, U32*, char**, char*)’:
toke.c:8819:13: error: ‘my_vars’ was not declared in this scope
toke.c:8849:39: error: ‘my_vars’ was not declared in this scope
sv.c: In function ‘char* Perl_sv_2pv_flags(PerlInterpreter*, SV*, STRLEN*, I32)’:
regcomp.c: In function ‘char* S_nextchar(PerlInterpreter*, RExC_state_t*)’:
regcomp.c:10478:10: error: ‘my_vars’ was not declared in this scope
toke.c: In function ‘SV* Perl_parse_label(PerlInterpreter*, U32)’:
toke.c:11306:7: error: ‘my_vars’ was not declared in this scope
toke.c:11310:10: error: ‘my_vars’ was not declared in this scope
regcomp.c: In function ‘void S_put_byte(PerlInterpreter*, SV*, int)’:
regcomp.c:11904:10: error: ‘my_vars’ was not declared in this scope
perl.c: In function ‘int Perl_get_debug_opts(PerlInterpreter*, const char**, bool)’:
perl.c:2967:9: error: ‘my_vars’ was not declared in this scope
perl.h:4980:22: error: uninitialized const member in ‘struct perl_vars’
sv.c:10890:53: warning: ignoring return value of ‘char* qgcvt(long double, int, char*)’, declared with attribute warn_unused_result [-Wunused-result]
sv.c:2762:39: warning: ignoring return value of ‘char* qgcvt(long double, int, char*)’, declared with attribute warn_unused_result [-Wunused-result]
sv.c:2951:39: warning: ignoring return value of ‘char* qgcvt(long double, int, char*)’, declared with attribute warn_unused_result [-Wunused-result]
toke.c:7931:19: warning: variable ‘have_proto’ set but not used [-Wunused-but-set-variable]
hv.c: In function ‘SV* S_hv_delete_common(PerlInterpreter*, HV*, SV*, const char*, STRLEN, int, I32, U32)’:
hv.c: In function ‘void S_clear_placeholders(PerlInterpreter*, HV*, U32)’:
hv.c: In function ‘void S_unshare_hek_or_pvn(PerlInterpreter*, const HEK*, const char*, I32, U32)’:
regcomp.c: In function ‘regnode* S_regpiece(PerlInterpreter*, RExC_state_t*, I32*, U32)’:
regcomp.c: In function ‘void* Perl_regdupe_internal(PerlInterpreter*, REGEXP*, CLONE_PARAMS*)’:
regcomp.c:11674:14: warning: variable ‘npar’ set but not used [-Wunused-but-set-variable]
perlio.c:510:56: warning: ignoring return value of ‘ssize_t write(int, const void*, size_t)’, declared with attribute warn_unused_result [-Wunused-result]
sv.c: In function ‘DIR* Perl_dirp_dup(PerlInterpreter*, DIR*, CLONE_PARAMS*)’:
sv.c:11337:26: warning: ignoring return value of ‘int fchdir(int)’, declared with attribute warn_unused_result [-Wunused-result]
perl.c: In function ‘void S_init_tls_and_interp(PerlInterpreter*)’:
perl.c:105:2: warning: ignoring return value of ‘ssize_t write(int, const void*, size_t)’, declared with attribute warn_unused_result [-Wunused-result]
Dumper.xs: In function ‘I32 DD_dump(PerlInterpreter*, SV*, const char*, STRLEN, SV*, HV*, AV*, I32*, I32, SV*, SV*, SV*, SV*, SV*, SV*, SV*, I32, I32, I32, SV*, I32, SV*)’:
Call.xs: In function ‘I32 filter_call(PerlInterpreter*, int, SV*, int)’:
shared.xs: In function ‘user_lock* S_get_userlock(PerlInterpreter*, SV*, bool)’:
shared.xs:348:5: warning: deprecated conversion from string constant to ‘char*’ [-Wwrite-strings]
shared.xs: In function ‘void S_sharedsv_dec(PerlInterpreter*, SV*)’:
shared.xs:521:5: warning: deprecated conversion from string constant to ‘char*’ [-Wwrite-strings]
shared.xs: In function ‘void Perl_sharedsv_share(PerlInterpreter*, SV*)’:
shared.xs:550:9: warning: deprecated conversion from string constant to ‘char*’ [-Wwrite-strings]
shared.xs: In function ‘int sharedsv_scalar_mg_get(PerlInterpreter*, SV*, MAGIC*)’:
shared.xs:716:5: warning: deprecated conversion from string constant to ‘char*’ [-Wwrite-strings]
shared.xs: In function ‘int sharedsv_scalar_mg_set(PerlInterpreter*, SV*, MAGIC*)’:
shared.xs:794:5: warning: deprecated conversion from string constant to ‘char*’ [-Wwrite-strings]
shared.xs: In function ‘int sharedsv_scalar_mg_local(PerlInterpreter*, SV*, MAGIC*)’:
shared.xs:837:9: warning: deprecated conversion from string constant to ‘char*’ [-Wwrite-strings]
shared.xs: In function ‘int sharedsv_elem_mg_FETCH(PerlInterpreter*, SV*, MAGIC*)’:
shared.xs:874:5: warning: deprecated conversion from string constant to ‘char*’ [-Wwrite-strings]
shared.xs: In function ‘int sharedsv_elem_mg_STORE(PerlInterpreter*, SV*, MAGIC*)’:
shared.xs:932:5: warning: deprecated conversion from string constant to ‘char*’ [-Wwrite-strings]
shared.xs: In function ‘int sharedsv_elem_mg_DELETE(PerlInterpreter*, SV*, MAGIC*)’:
shared.xs:974:5: warning: deprecated conversion from string constant to ‘char*’ [-Wwrite-strings]
shared.xs: In function ‘U32 sharedsv_array_mg_FETCHSIZE(PerlInterpreter*, SV*, MAGIC*)’:
shared.xs:1037:5: warning: deprecated conversion from string constant to ‘char*’ [-Wwrite-strings]
shared.xs: In function ‘int sharedsv_array_mg_CLEAR(PerlInterpreter*, SV*, MAGIC*)’:
shared.xs:1056:5: warning: deprecated conversion from string constant to ‘char*’ [-Wwrite-strings]
shared.xs: In function ‘void Perl_sharedsv_lock(PerlInterpreter*, SV*)’:
shared.xs:1145:63: warning: deprecated conversion from string constant to ‘char*’ [-Wwrite-strings]
shared.xs: In function ‘void XS_threads__shared__tie_PUSH(PerlInterpreter*, CV*)’:
shared.xs:1241:13: warning: deprecated conversion from string constant to ‘char*’ [-Wwrite-strings]
shared.xs: In function ‘void XS_threads__shared__tie_UNSHIFT(PerlInterpreter*, CV*)’:
shared.xs:1258:9: warning: deprecated conversion from string constant to ‘char*’ [-Wwrite-strings]
shared.xs: In function ‘void XS_threads__shared__tie_POP(PerlInterpreter*, CV*)’:
shared.xs:1281:9: warning: deprecated conversion from string constant to ‘char*’ [-Wwrite-strings]
shared.xs: In function ‘void XS_threads__shared__tie_SHIFT(PerlInterpreter*, CV*)’:
shared.xs:1298:9: warning: deprecated conversion from string constant to ‘char*’ [-Wwrite-strings]
shared.xs: In function ‘void XS_threads__shared__tie_EXTEND(PerlInterpreter*, CV*)’:
shared.xs:1314:9: warning: deprecated conversion from string constant to ‘char*’ [-Wwrite-strings]
shared.xs: In function ‘void XS_threads__shared__tie_STORESIZE(PerlInterpreter*, CV*)’:
shared.xs:1324:9: warning: deprecated conversion from string constant to ‘char*’ [-Wwrite-strings]
shared.xs: In function ‘void XS_threads__shared__tie_EXISTS(PerlInterpreter*, CV*)’:
shared.xs:1336:13: warning: deprecated conversion from string constant to ‘char*’ [-Wwrite-strings]
shared.xs:1346:13: warning: deprecated conversion from string constant to ‘char*’ [-Wwrite-strings]
shared.xs: In function ‘void XS_threads__shared__tie_FIRSTKEY(PerlInterpreter*, CV*)’:
shared.xs:1362:9: warning: deprecated conversion from string constant to ‘char*’ [-Wwrite-strings]
shared.xs: In function ‘void XS_threads__shared__tie_NEXTKEY(PerlInterpreter*, CV*)’:
shared.xs:1390:9: warning: deprecated conversion from string constant to ‘char*’ [-Wwrite-strings]
shared.xs: In function ‘void XS_threads__shared_bless(PerlInterpreter*, CV*)’:
shared.xs:1650:13: warning: deprecated conversion from string constant to ‘char*’ [-Wwrite-strings]
threads.xs: In function ‘ithread* S_ithread_create(PerlInterpreter*, SV*, IV, int, int, int, int)’:
threads.xs:711:83: warning: ignoring return value of ‘ssize_t write(int, const void*, size_t)’, declared with attribute warn_unused_result [-Wunused-result]
Collate.xs: In function ‘void XS_Unicode__Collate_getHST(PerlInterpreter*, CV*)’:
Collate.xs: In function ‘void XS_Unicode__Collate_visualizeSortKey(PerlInterpreter*, CV*)’:
regcomp.c: In function ‘void S_dump_trie(PerlInterpreter*, const _reg_trie_data*, HV*, AV*, U32)’:
regcomp.c: In function ‘void S_dump_trie_interim_list(PerlInterpreter*, const _reg_trie_data*, HV*, AV*, U32, U32)’:
regcomp.c: In function ‘void S_dump_trie_interim_table(PerlInterpreter*, const _reg_trie_data*, HV*, AV*, U32, U32)’:
regcomp.c: In function ‘REGEXP* Perl_re_compile(PerlInterpreter*, SV*, U32)’:
regcomp.c: In function ‘SV* Perl_reg_named_buff_nextkey(PerlInterpreter*, REGEXP*, U32)’:
regcomp.c: In function ‘void Perl_pregfree2(PerlInterpreter*, REGEXP*)’:
hv.c: In function ‘refcounted_he* Perl_refcounted_he_inc(PerlInterpreter*, refcounted_he*)’:
hv.c:3402:2: error: ‘my_vars’ was not declared in this scope
hv.c:3404:2: error: ‘my_vars’ was not declared in this scope
regexec.c:3771:1: warning: variable ‘ok’ set but not used [-Wunused-but-set-variable]numeric.c: In function ‘char* Perl_my_atof2(PerlInterpreter*, const char*, NV*)’:
-- 
Report by Test::Smoke v1.53 build 1374 running on perl 5.14.2
(Reporter v0.050 / Smoker v0.045)




nntp.perl.org: Perl Programming lists via nntp and http.
Comments to Ask Bjørn Hansen at ask@perl.org | Group listing | About