develooper Front page | perl.perl5.porters | Postings from January 2013

Smoke [blead] v5.17.8-19-gfd09fb4 FAIL(XM) linux 3.5.0-22-generic [debian] (x86_64/8 cpu) {blead_clang}

From:
George Greer
Date:
January 25, 2013 02:10
Subject:
Smoke [blead] v5.17.8-19-gfd09fb4 FAIL(XM) linux 3.5.0-22-generic [debian] (x86_64/8 cpu) {blead_clang}
Message ID:
201301250210.r0P2AC9f005695@m-l.org
Smoke logs available at http://m-l.org/~perl/smoke/perl/linux/blead_clang/logfd09fb46b20a60bca1df0e3f554d1df854923cc7.log.gz

Automated smoke report for 5.17.9 patch fd09fb46b20a60bca1df0e3f554d1df854923cc7 v5.17.8-19-gfd09fb4
zwei: Intel(R) Core(TM) i7 CPU 920 @ 2.67GHz (GenuineIntel 2668MHz) (x86_64/8 cpu)
    on        linux - 3.5.0-22-generic [debian]
    using     clang version 4.2.1 Compatible Clang 3.3 (trunk 168545)
    smoketime 1 day 10 hours 25 minutes (average 1 hour 26 minutes)

Summary: FAIL(XM)

O = OK  F = Failure(s), extended report at the bottom
X = Failure(s) under TEST but not under harness
? = still running or test results not (yet) available
Build failures during:       - = unknown or N/A
c = Configure, m = make, M = make (after miniperl), t = make test-prep

v5.17.8-19-gfd09fb4  Configuration (common) -Dcc=clang
----------- ---------------------------------------------------------
O O O O O O 
O O O O O O -Accflags=-DPERL_POISON
O O O O O O -Duse64bitall -Accflags=-DPERL_GLOBAL_STRUCT
X X X X X X -Dusemorebits -Accflags=-DPERL_GLOBAL_STRUCT_PRIVATE
O O O O O O -Dmad
X X X X X X -Accflags=-DPERL_OLD_COPY_ON_WRITE
O O O O O O -Duseithreads
O O O O O O -Duseithreads -Accflags=-DPERL_POISON
O O O O O X -Duseithreads -Duse64bitall -Accflags=-DPERL_GLOBAL_STRUCT
M - - M - - -Duseithreads -Dusemorebits -Accflags=-DPERL_GLOBAL_STRUCT_PRIVATE
O O O O O O -Duseithreads -Dmad
X X X X X X -Duseithreads -Accflags=-DPERL_OLD_COPY_ON_WRITE
| | | | | +- LC_ALL = en_US.utf8 -DDEBUGGING
| | | | +--- PERLIO = perlio -DDEBUGGING
| | | +----- PERLIO = stdio  -DDEBUGGING
| | +------- LC_ALL = en_US.utf8
| +--------- PERLIO = perlio
+----------- PERLIO = stdio 

Locally applied patches:
    SMOKEfd09fb46b20a60bca1df0e3f554d1df854923cc7

Failures: (common-args) -Dcc=clang
[stdio] -Dusemorebits -Accflags=-DPERL_GLOBAL_STRUCT_PRIVATE
[stdio] -DDEBUGGING -Dusemorebits -Accflags=-DPERL_GLOBAL_STRUCT_PRIVATE
Inconsistent test results (between TEST and harness):
    ../t/porting/globvar.t.................. ............................................ FAILED at test 1

[perlio/en_US.utf8] -Dusemorebits -Accflags=-DPERL_GLOBAL_STRUCT_PRIVATE
[perlio/en_US.utf8] -DDEBUGGING -Dusemorebits -Accflags=-DPERL_GLOBAL_STRUCT_PRIVATE
Inconsistent test results (between TEST and harness):
    ../t/comp/require.t..................... ............................................... FAILED at test 47
    ../t/porting/globvar.t.................. ............................................ FAILED at test 1

[stdio] -Accflags=-DPERL_OLD_COPY_ON_WRITE
[stdio] -Duseithreads -Accflags=-DPERL_OLD_COPY_ON_WRITE
Inconsistent test results (between TEST and harness):
    ../ext/Devel-Peek/t/Peek.t.............. ........................................ FAILED at test 39

[perlio/en_US.utf8] -Accflags=-DPERL_OLD_COPY_ON_WRITE
[perlio] -Duseithreads -Accflags=-DPERL_OLD_COPY_ON_WRITE
Inconsistent test results (between TEST and harness):
    ../t/comp/require.t..................... ............................................... FAILED at test 47
    ../ext/Devel-Peek/t/Peek.t.............. ........................................ FAILED at test 39

[stdio] -DDEBUGGING -Accflags=-DPERL_OLD_COPY_ON_WRITE
[stdio] -DDEBUGGING -Duseithreads -Accflags=-DPERL_OLD_COPY_ON_WRITE
Inconsistent test results (between TEST and harness):
    ../ext/PerlIO-encoding/t/encoding.t..... ............................... FAILED--expected 24 tests, saw 19
    ../ext/Devel-Peek/t/Peek.t.............. ........................................ FAILED at test 39

[perlio/en_US.utf8] -DDEBUGGING -Accflags=-DPERL_OLD_COPY_ON_WRITE
[en_US.utf8] -DDEBUGGING -Duseithreads -Accflags=-DPERL_OLD_COPY_ON_WRITE
Inconsistent test results (between TEST and harness):
    ../ext/PerlIO-encoding/t/encoding.t..... ............................... FAILED--expected 24 tests, saw 19
    ../t/comp/require.t..................... ............................................... FAILED at test 47
    ../ext/Devel-Peek/t/Peek.t.............. ........................................ FAILED at test 39

[en_US.utf8] -DDEBUGGING -Duseithreads -Duse64bitall -Accflags=-DPERL_GLOBAL_STRUCT
Inconsistent test results (between TEST and harness):
    ../lib/Benchmark.t...................... ................................................ FAILED at test 15

[minitest] -Duseithreads -Dusemorebits -Accflags=-DPERL_GLOBAL_STRUCT_PRIVATE
    t/base/cond .................... FAILED--non-zero wait status: 2304

[minitest] -DDEBUGGING -Duseithreads -Dusemorebits -Accflags=-DPERL_GLOBAL_STRUCT_PRIVATE
    t/base/cond .................... FAILED--non-zero wait status: 139

[en_US.utf8] -Duseithreads -Accflags=-DPERL_OLD_COPY_ON_WRITE
Inconsistent test results (between TEST and harness):
    ../t/comp/require.t..................... ............................................... FAILED at test 49
    ../ext/Devel-Peek/t/Peek.t.............. ........................................ FAILED at test 39

[perlio] -DDEBUGGING -Duseithreads -Accflags=-DPERL_OLD_COPY_ON_WRITE
Inconsistent test results (between TEST and harness):
    ../ext/PerlIO-encoding/t/encoding.t..... ............................... FAILED--expected 24 tests, saw 19
    ../t/comp/require.t..................... ............................................... FAILED at test 47
    ../lib/Benchmark.t...................... ................................................ FAILED at test 15
    ../ext/Devel-Peek/t/Peek.t.............. ........................................ FAILED at test 39

Compiler messages(gcc):
regcomp.c:11382:33: warning: unused parameter 'oregcomp_parse' [-Wunused-parameter]
DosGlob.xs:25:2: warning: expression result unused [-Wunused-value]
Call.xs:63:11: warning: format specifies type 'int' but the argument has type 'STRLEN' (aka 'unsigned long') [-Wformat]
Call.xs:63:31: warning: format specifies type 'int' but the argument has type 'STRLEN' (aka 'unsigned long') [-Wformat]
Call.xs:100:13: warning: format specifies type 'int' but the argument has type 'STRLEN' (aka 'unsigned long') [-Wformat]
Call.xs:156:11: warning: format specifies type 'int' but the argument has type 'STRLEN' (aka 'unsigned long') [-Wformat]
Call.xs:175:14: warning: format specifies type 'int' but the argument has type 'STRLEN' (aka 'unsigned long') [-Wformat]
Glob.xs:96:2: warning: expression result unused [-Wunused-value]
Glob.xs:104:6: warning: expression result unused [-Wunused-value]
Glob.xs:324:2: warning: expression result unused [-Wunused-value]
Storable.xs:4068:2: warning: null passed to a callee which requires a non-null argument [-Wnonnull]
Storable.xs:4255:10: warning: null passed to a callee which requires a non-null argument [-Wnonnull]
Storable.xs:5550:2: warning: null passed to a callee which requires a non-null argument [-Wnonnull]
Storable.xs:5613:2: warning: null passed to a callee which requires a non-null argument [-Wnonnull]
Collate.xs:616:2: warning: expression result unused [-Wunused-value]
Collate.xs:606:2: warning: expression result unused [-Wunused-value]
util.c:3653:12: warning: returning 'const MGVTBL *' (aka 'const struct mgvtbl *') from a function with result type 'MGVTBL *' (aka 'struct mgvtbl *') discards qualifiers [-Wincompatible-pointer-types]
APItest.xs:3525:2: warning: assigning to 'MGVTBL *' (aka 'struct mgvtbl *') from 'const MGVTBL *' (aka 'const struct mgvtbl *') discards qualifiers [-Wincompatible-pointer-types]
APItest.xs:3526:2: warning: assigning to 'MGVTBL *' (aka 'struct mgvtbl *') from 'const MGVTBL *' (aka 'const struct mgvtbl *') discards qualifiers [-Wincompatible-pointer-types]
APItest.xs:3527:2: warning: assigning to 'MGVTBL *' (aka 'struct mgvtbl *') from 'const MGVTBL *' (aka 'const struct mgvtbl *') discards qualifiers [-Wincompatible-pointer-types]
APItest.xs:3528:2: warning: assigning to 'MGVTBL *' (aka 'struct mgvtbl *') from 'const MGVTBL *' (aka 'const struct mgvtbl *') discards qualifiers [-Wincompatible-pointer-types]
APItest.xs:3529:2: warning: assigning to 'MGVTBL *' (aka 'struct mgvtbl *') from 'const MGVTBL *' (aka 'const struct mgvtbl *') discards qualifiers [-Wincompatible-pointer-types]
APItest.xs:3530:2: warning: assigning to 'MGVTBL *' (aka 'struct mgvtbl *') from 'const MGVTBL *' (aka 'const struct mgvtbl *') discards qualifiers [-Wincompatible-pointer-types]
APItest.xs:3531:2: warning: assigning to 'MGVTBL *' (aka 'struct mgvtbl *') from 'const MGVTBL *' (aka 'const struct mgvtbl *') discards qualifiers [-Wincompatible-pointer-types]
APItest.xs:3532:2: warning: assigning to 'MGVTBL *' (aka 'struct mgvtbl *') from 'const MGVTBL *' (aka 'const struct mgvtbl *') discards qualifiers [-Wincompatible-pointer-types]
APItest.xs:3533:2: warning: assigning to 'MGVTBL *' (aka 'struct mgvtbl *') from 'const MGVTBL *' (aka 'const struct mgvtbl *') discards qualifiers [-Wincompatible-pointer-types]
APItest.xs:3534:2: warning: assigning to 'MGVTBL *' (aka 'struct mgvtbl *') from 'const MGVTBL *' (aka 'const struct mgvtbl *') discards qualifiers [-Wincompatible-pointer-types]
APItest.xs:3535:2: warning: assigning to 'MGVTBL *' (aka 'struct mgvtbl *') from 'const MGVTBL *' (aka 'const struct mgvtbl *') discards qualifiers [-Wincompatible-pointer-types]
APItest.xs:3536:2: warning: assigning to 'MGVTBL *' (aka 'struct mgvtbl *') from 'const MGVTBL *' (aka 'const struct mgvtbl *') discards qualifiers [-Wincompatible-pointer-types]
APItest.xs:3537:2: warning: assigning to 'MGVTBL *' (aka 'struct mgvtbl *') from 'const MGVTBL *' (aka 'const struct mgvtbl *') discards qualifiers [-Wincompatible-pointer-types]
APItest.xs:3538:2: warning: assigning to 'MGVTBL *' (aka 'struct mgvtbl *') from 'const MGVTBL *' (aka 'const struct mgvtbl *') discards qualifiers [-Wincompatible-pointer-types]
APItest.xs:3539:2: warning: assigning to 'MGVTBL *' (aka 'struct mgvtbl *') from 'const MGVTBL *' (aka 'const struct mgvtbl *') discards qualifiers [-Wincompatible-pointer-types]
APItest.xs:3540:2: warning: assigning to 'MGVTBL *' (aka 'struct mgvtbl *') from 'const MGVTBL *' (aka 'const struct mgvtbl *') discards qualifiers [-Wincompatible-pointer-types]
APItest.xs:3541:2: warning: assigning to 'MGVTBL *' (aka 'struct mgvtbl *') from 'const MGVTBL *' (aka 'const struct mgvtbl *') discards qualifiers [-Wincompatible-pointer-types]
APItest.xs:3542:2: warning: assigning to 'MGVTBL *' (aka 'struct mgvtbl *') from 'const MGVTBL *' (aka 'const struct mgvtbl *') discards qualifiers [-Wincompatible-pointer-types]
APItest.xs:3543:2: warning: assigning to 'MGVTBL *' (aka 'struct mgvtbl *') from 'const MGVTBL *' (aka 'const struct mgvtbl *') discards qualifiers [-Wincompatible-pointer-types]
APItest.xs:3544:2: warning: assigning to 'MGVTBL *' (aka 'struct mgvtbl *') from 'const MGVTBL *' (aka 'const struct mgvtbl *') discards qualifiers [-Wincompatible-pointer-types]
APItest.xs:3545:2: warning: assigning to 'MGVTBL *' (aka 'struct mgvtbl *') from 'const MGVTBL *' (aka 'const struct mgvtbl *') discards qualifiers [-Wincompatible-pointer-types]
APItest.xs:3546:2: warning: assigning to 'MGVTBL *' (aka 'struct mgvtbl *') from 'const MGVTBL *' (aka 'const struct mgvtbl *') discards qualifiers [-Wincompatible-pointer-types]
APItest.xs:3547:2: warning: assigning to 'MGVTBL *' (aka 'struct mgvtbl *') from 'const MGVTBL *' (aka 'const struct mgvtbl *') discards qualifiers [-Wincompatible-pointer-types]
APItest.xs:3549:2: warning: assigning to 'MGVTBL *' (aka 'struct mgvtbl *') from 'const MGVTBL *' (aka 'const struct mgvtbl *') discards qualifiers [-Wincompatible-pointer-types]
APItest.xs:3551:2: warning: assigning to 'MGVTBL *' (aka 'struct mgvtbl *') from 'const MGVTBL *' (aka 'const struct mgvtbl *') discards qualifiers [-Wincompatible-pointer-types]
APItest.xs:3552:2: warning: assigning to 'MGVTBL *' (aka 'struct mgvtbl *') from 'const MGVTBL *' (aka 'const struct mgvtbl *') discards qualifiers [-Wincompatible-pointer-types]
dump.c:2642:57: warning: comparison of constant 85 with expression of type 'svtype' is always false [-Wtautological-constant-out-of-range-compare]
sv.c:4762:44: warning: unused parameter 'pvx' [-Wunused-parameter]
-- 
Report by Test::Smoke v1.53 build 1374 running on perl 5.14.2
(Reporter v0.050 / Smoker v0.045)




nntp.perl.org: Perl Programming lists via nntp and http.
Comments to Ask Bjørn Hansen at ask@perl.org | Group listing | About